program: Gaussian 09
title: 000224428
version: EM64L-G09RevD.01
frameworkgroup: C1[X(C17H20Cl2N2)]
method: RPBEPBE
basis: SDD
operation: Freq
keyword: #p
keyword: freq=noraman
keyword: PBEPBE/SDD
title: #p freq=noraman PBEPBE/SDD
converged: YES YES NO NO
title: Mulliken charges:
elementType: Cl Cl N N C C C C C C C C C C C C C C C C C H H H H H H H H H H H H H H H H H H H H
charge: -0.100942 -0.100943 -0.156194 -0.156194 -0.750909 0.644496 0.644496 0.417285 0.417282 -0.378568 -0.378568 -0.395921 -0.395917 -0.342285 -0.342286 -0.378096 -0.378095 -0.643584 -0.648886 -0.643584 -0.648886 0.242744 0.242743 0.245415 0.245415 0.263733 0.263733 0.237518 0.237518 0.233622 0.215977 0.233263 0.217288 0.233999 0.234591 0.233619 0.233265 0.215977 0.233998 0.217289 0.234592
chargesum: 0.00000
title: Mulliken charges with hydrogens summed into heavy atoms:
elementType: Cl Cl N N C C C C C C C C C C C C C C C C C
charge: -0.100942 -0.100943 -0.156194 -0.156194 -0.265422 0.644496 0.644496 0.417285 0.417282 -0.378568 -0.378568 -0.150506 -0.150502 -0.078552 -0.078553 -0.140578 -0.140578 0.039277 0.036992 0.039277 0.036993
polarizability: 2.98327250e+02 3.05087069e+00 2.19684853e+02 -3.62155287e-04 5.16902925e-05 1.70676117e+02
1716.lowfreq: -10.5605 -7.7967 -2.5331 0.0010 0.0012 0.0018 12.6823 22.3848 28.5652
frequency: 12.4494 22.3837 28.5514 57.5936 63.0847 69.6270 85.9285 100.0500 114.4341 135.2952 157.1064 157.6366 170.6689 171.9348 199.6344 207.3338 229.3537 239.4950 287.8993 310.9778 312.8849 324.1185 337.9085 362.1366 409.6639 417.5658 425.9000 443.2008 450.3056 492.9123 508.8712 521.1342 527.7280 586.5783 600.6618 663.4714 668.5274 678.6608 698.5229 734.2159 760.1290 805.5146 806.1513 830.7250 831.1396 836.4255 837.0095 916.2861 952.2589 954.2827 955.0805 955.2956 1007.3403 1011.2987 1056.1931 1056.6116 1110.1196 1110.1283 1110.5157 1110.5411 1125.2011 1158.7080 1168.5737 1172.5056 1191.6898 1213.6987 1227.8865 1262.9433 1263.4749 1280.2214 1295.1661 1310.3676 1354.4090 1355.3396 1369.4177 1378.7946 1416.8042 1417.3868 1435.4900 1435.5162 1454.7577 1455.0239 1464.2382 1464.2419 1469.7005 1474.9695 1475.0012 1493.6835 1493.8246 1503.5464 1504.7487 1518.8060 1523.4596 1542.5833 1545.0994 1630.5139 1635.3118 2934.5710 2934.6476 2943.1156 2943.6121 2998.5844 2998.5863 3001.9925 3002.0835 3014.9074 3071.3774 3092.3387 3092.3525 3103.3328 3103.4062 3130.1071 3130.2336 3167.4780 3167.5499 3185.5760 3185.6202
redmass: 6.0595 4.3479 4.9493 3.7199 2.9560 3.2412 2.8627 1.8820 2.1858 11.8301 1.8403 1.8251 4.7209 4.2588 1.4108 1.3516 2.0838 2.5317 3.7594 4.5965 3.8857 4.3567 3.9491 3.5223 7.1519 3.7468 3.0989 3.0625 3.2395 3.3267 3.8511 3.3102 4.4185 4.1382 3.3756 6.3359 6.5499 3.4835 2.8948 5.1195 2.9546 1.3849 2.3801 1.7339 1.7498 2.9174 5.1586 1.8463 1.4755 1.5676 2.4363 2.5608 3.4060 3.1852 1.4915 1.4964 1.3188 1.3188 1.2386 1.2382 1.5747 1.5074 1.8108 1.5691 1.1471 2.1807 2.0472 2.6202 2.7041 1.8278 1.5552 1.3493 3.0271 3.0602 5.2014 3.9825 2.7375 2.6697 1.3133 1.3142 1.2486 1.2356 1.0409 1.0409 1.0922 1.0462 1.0462 1.0876 1.0863 1.2710 1.2031 2.0780 2.3082 7.0308 6.4374 6.7526 6.9782 1.0368 1.0368 1.0394 1.0395 1.0994 1.0995 1.1026 1.1026 1.0597 1.1015 1.0961 1.0961 1.0939 1.0938 1.0893 1.0893 1.0937 1.0937 1.0909 1.0908
irintensity: 0.5881 1.2475 1.3376 1.6834 0.0031 1.9501 7.1682 1.2633 0.1111 0.0040 0.1644 0.1321 1.4474 0.3604 0.2285 0.6615 0.0242 0.2217 0.9517 0.6937 3.6507 2.5942 10.0954 1.9885 2.4406 1.0055 4.2626 7.6794 11.6033 7.9807 0.0067 2.4148 1.7528 3.3035 10.7079 7.3675 7.3901 0.5148 1.8739 22.4143 1.1896 22.8336 31.5649 33.4014 55.7889 5.0634 8.3271 9.9603 3.9465 2.8474 26.4542 64.3410 20.0939 57.0426 1.5683 52.1812 0.6898 1.4389 0.0021 0.0220 3.2180 0.7742 0.4615 22.8625 1.2442 0.0002 9.8043 2.8439 65.4005 45.9952 7.1807 0.3126 101.1125 25.4605 63.4494 0.0135 12.9702 0.7541 3.5168 0.7164 57.9251 20.1229 0.0546 0.7130 13.0102 12.1439 28.2476 8.0067 0.9841 2.2896 1.8621 465.6005 142.6205 64.9984 19.6377 383.5720 126.0677 4.8340 218.9581 138.5374 44.0862 13.8217 8.0327 54.7230 108.0974 19.8340 2.9091 1.5521 8.3578 69.9751 26.6550 1.3391 6.6918 26.2877 4.3847 8.1640 1.3183
temp: 298.150 k
press: 1.00000 atm
elementType: 17 17 7 7 6 6 6 6 6 6 6 6 6 6 6 6 6 6 6 6 6 1 1 1 1 1 1 1 1 1 1 1 1 1 1 1 1 1 1 1 1
symmnumber: 1
zpe: 865402.7 jmol-1
zpe.correction: 0.329614 hartree
zpe.thermalcorrener: 0.351888 hartree
zpe.thermalcorrenthalpy: 0.352833 hartree
zpe.thermalcorrgfe: 0.275267 hartree
zpe.sumelectzpe: -1687.870826 hartree
zpe.sumelectthermal: -1687.848552 hartree
zpe.sumelectthermalent: -1687.847608 hartree
zpe.sumelectthermalfe: -1687.925173 hartree
dipole: 0.0001 0.0000 4.6788
dipole: 4.6788
quadrupole: -93.6624 -137.2326 -137.8573
quadrupole: 7.9730 -0.0008 0.0000
quadrupole: 29.2550 -14.3151 -14.9399 7.9730 -0.0008 0.0000
hfenergy: -1688.2004404 hartree
pointgroup: C01 [X(C17H20Cl2N2)]
dipole: -0.0008405 -1.8407701 0.0006216 debye
polarizability: 298.3407128|-0.0537694|170.6761453|2.8717833|0.0153877|219.6713617 unknown
InChI: InChI=1S/C17H20Cl2N2/c1-20(2)14-7-5-12(16(18)10-14)9-13-6-8-15(21(3)4)11-17(13)19/h5-8,10-11H,9H2,1-4H3
charge 0 multiplicity 1
41 atoms
Cl -1.842218 1.640439 2.61969
Cl 1.843585 1.637065 -2.621206
N  -4.835392 -1.311305 -0.472994
N  4.834251 -1.31505 0.473553
C  0.000795 1.923762 -0.000857
C  -1.273227 1.086455 -0.094383
C  1.274121 1.085464 0.09325
C  -3.676701 -0.53633 -0.352406
C  3.676213 -0.539186 0.352414
C  -2.172169 0.871898 0.972822
C  2.172885 0.8694 -0.973799
C  -1.629158 0.444617 -1.312752
C  1.629499 0.44417 1.312067
C  -3.340415 0.097044 0.884109
C  3.340473 0.093617 -0.884542
C  -2.784353 -0.341515 -1.455198
C  2.784018 -0.342852 1.455063
C  -5.157165 -1.953154 -1.752588
C  -5.726674 -1.479686 0.679521
C  5.1554 -1.956393 1.753557
C  5.725329 -1.485096 -0.678878
H  0.062481 2.578285 -0.887841
H  -0.060354 2.578934 0.885684
H  -0.964357 0.57561 -2.174808
H  0.964799 0.576317 2.174024
H  -3.976597 -0.006939 1.764822
H  3.976576 -0.0115 -1.765176
H  -2.993589 -0.800914 -2.424865
H  2.992844 -0.801767 2.425047
H  -4.367072 -2.665229 -2.068372
H  -6.098667 -2.516158 -1.65264
H  -5.290464 -1.210898 -2.566446
H  -6.582395 -2.111428 0.393501
H  -5.212092 -1.970024 1.531838
H  -6.12663 -0.508465 1.037649
H  4.364765 -2.66772 2.069676
H  5.289145 -1.213754 2.56699
H  6.096509 -2.520128 1.65405
H  5.210268 -1.975605 -1.530808
H  6.580502 -2.117385 -0.392429
H  6.126133 -0.514497 -1.037742
