program: Gaussian 09
title: 000224422
version: EM64L-G09RevD.01
frameworkgroup: C1[X(C15H10BrN)]
method: RPBEPBE
basis: SDD
operation: Freq
keyword: #p
keyword: freq=noraman
keyword: PBEPBE/SDD
title: #p freq=noraman PBEPBE/SDD
converged: YES YES NO NO
title: Mulliken charges:
elementType: Br N C C C C C C C C C C C C C C C H H H H H H H H H H
charge: 0.011040 0.000384 0.434073 0.010599 -0.097839 0.452709 -0.313767 -0.313982 -0.392358 -0.316414 -0.386168 -0.375486 -0.247188 -0.222915 -0.204495 -0.239171 -0.228391 0.243030 0.251528 0.234525 0.265849 0.251367 0.230677 0.233178 0.249782 0.232968 0.236467
chargesum: 0.00000
title: Mulliken charges with hydrogens summed into heavy atoms:
elementType: Br N C C C C C C C C C C C C C C C
charge: 0.011040 0.000384 0.434073 0.010599 -0.097839 0.452709 -0.070737 -0.062454 -0.157833 -0.050565 -0.386168 -0.124119 -0.016511 0.010263 0.045287 -0.006203 0.008076
polarizability: 2.88162034e+02 3.17557060e+01 1.81002528e+02 7.22251076e+00 -1.64668644e+01 1.02199720e+02
1716.lowfreq: -7.7004 -0.0008 -0.0006 -0.0003 4.1302 5.0814 31.2338 45.8083 69.9831
frequency: 31.1374 45.7923 69.9755 125.4526 147.3513 177.0399 212.1057 240.3361 287.3392 329.4168 367.0793 397.7996 425.7220 460.4068 479.9665 516.5542 531.5349 554.4297 563.3849 616.1970 639.4290 687.5237 704.0137 731.7277 753.0372 757.9061 772.2073 802.6811 841.5562 853.5381 872.2953 887.0777 922.9892 951.2416 965.0739 982.7890 986.7302 997.8815 1001.8147 1015.5602 1029.9730 1070.9424 1113.0841 1125.5987 1150.6380 1166.5949 1174.3740 1234.2780 1248.0129 1259.4217 1277.3667 1295.8641 1354.6032 1362.1140 1403.9905 1411.8607 1419.6426 1449.2578 1470.9782 1502.1370 1545.4571 1566.7622 1593.0240 1598.4268 1625.1528 3120.8198 3129.1208 3131.4048 3137.7638 3143.0543 3155.9620 3159.7055 3161.2982 3171.4445 3174.5729
redmass: 5.4762 7.4267 4.9879 5.4882 5.4944 4.4041 5.7336 7.4774 5.2376 7.6726 5.1943 3.5755 3.6768 3.7910 2.9474 7.1524 4.3637 4.5357 4.6795 7.3045 6.6587 3.3322 6.6286 3.1621 2.7607 1.4496 1.5622 3.0943 1.4593 5.0006 1.4826 1.6822 5.1805 1.3857 1.3525 1.3794 1.3465 1.3357 6.4888 2.2681 3.5634 2.1828 1.8261 1.5999 1.2074 1.1096 1.0587 1.8790 1.7188 1.4694 3.2697 2.3934 4.8743 6.6139 4.1630 2.0735 2.3844 2.6095 3.2367 3.5191 7.2208 6.1346 6.4488 6.8485 6.6323 1.0875 1.0885 1.0863 1.0892 1.0902 1.0950 1.0956 1.0968 1.0993 1.0995
irintensity: 0.0750 1.0949 1.0061 0.3318 1.0356 3.7317 0.6205 0.9491 0.2822 1.9820 2.6785 0.7232 4.2838 6.1898 11.1590 0.3395 4.9112 2.9100 1.7336 4.8246 10.8137 1.7027 11.0505 7.9931 23.3589 24.4456 96.5156 0.6423 57.2512 0.4576 1.6376 3.2684 5.1524 1.6585 1.4572 2.5841 0.2280 0.0805 43.5801 4.6360 16.5444 7.2030 8.3927 2.7259 0.5278 1.6362 0.4921 2.1315 5.7844 2.8638 16.4224 3.3464 8.5786 5.7949 6.4346 18.4294 24.7970 20.3229 9.5071 33.6199 21.1754 13.8361 34.9503 8.5230 6.2614 4.2233 10.6803 1.5918 12.5563 9.4367 26.8879 9.7315 19.9746 21.7791 18.7279
temp: 298.150 k
press: 1.00000 atm
elementType: 35 7 6 6 6 6 6 6 6 6 6 6 6 6 6 6 6 1 1 1 1 1 1 1 1 1 1
symmnumber: 1
zpe: 530189.7 jmol-1
zpe.correction: 0.201939 hartree
zpe.thermalcorrener: 0.215138 hartree
zpe.thermalcorrenthalpy: 0.216082 hartree
zpe.thermalcorrgfe: 0.160228 hartree
zpe.sumelectzpe: -644.667691 hartree
zpe.sumelectthermal: -644.654491 hartree
zpe.sumelectthermalent: -644.653547 hartree
zpe.sumelectthermalfe: -644.709401 hartree
dipole: -0.8457 2.7398 -0.6955
dipole: 2.9505
quadrupole: -83.0778 -98.4007 -109.4742
quadrupole: 3.9076 3.6429 -4.6463
quadrupole: 13.9064 -1.4165 -12.4900 3.9076 3.6429 -4.6463
hfenergy: -644.8696293 hartree
pointgroup: C01 [X(C15H10Br1N1)]
dipole: 0.1965181 -0.2405065 1.1184775 debye
polarizability: 293.8933915|-9.4476173|101.4296115|-18.17908|-14.4266015|176.0412796 unknown
InChI: InChI=1S/C15H10BrN/c16-13-7-3-2-6-12(13)15-10-9-11-5-1-4-8-14(11)17-15/h1-10H
charge 0 multiplicity 1
27 atoms
Br -1.677101 -0.616127 -2.691229
N  0.477152 0.518941 -0.511311
C  2.410229 -0.518044 0.664465
C  -0.354159 -0.129577 0.332312
C  1.844045 0.334969 -0.36258
C  -1.82532 0.102968 0.184265
C  1.494756 -1.182805 1.543329
C  0.123694 -0.99103 1.383598
C  3.832318 -0.658069 0.754253
C  2.722136 1.019808 -1.263264
C  -2.541421 -0.004481 -1.037618
C  -2.567969 0.467153 1.343332
C  4.665438 0.021239 -0.137986
C  4.105983 0.864548 -1.152222
C  -3.925614 0.261957 -1.110508
C  -3.950174 0.737138 1.287079
C  -4.63107 0.639912 0.053472
H  1.880135 -1.8445 2.32783
H  -0.597805 -1.505877 2.025121
H  4.257985 -1.305147 1.53095
H  2.267736 1.656026 -2.028889
H  -2.031354 0.566399 2.293637
H  5.753159 -0.087897 -0.066817
H  4.773368 1.389352 -1.844498
H  -4.447626 0.165391 -2.066777
H  -4.488842 1.027462 2.195086
H  -5.704081 0.849795 -0.009634
