program: Gaussian 09
title: 000217939
version: EM64L-G09RevD.01
frameworkgroup: C1[X(C13H14O6)]
method: RPBEPBE
basis: SDD
operation: Freq
keyword: #pfreq=noraman
keyword: PBEPBE/SDD
title: #p freq=noraman PBEPBE/SDD
converged: YES YES NO NO
title: Mulliken charges:
elementType: O O O O O O C C C C C C C C C C C C C H H H H H H H H H H H H H H
charge: -0.327307 -0.318998 -0.259428 -0.238178 -0.421088 -0.244466 0.214801 0.153901 0.080093 0.214020 -0.356586 -0.353995 0.056037 -0.227980 -0.521150 -0.528325 -0.493607 -0.261318 0.149533 0.287007 0.260435 0.315704 0.258555 0.229106 0.240535 0.264492 0.223910 0.231651 0.236703 0.234081 0.232990 0.290327 0.378546
chargesum: 0.00000
title: Mulliken charges with hydrogens summed into heavy atoms:
elementType: O O O O O O C C C C C C C C C C C C C
charge: -0.327307 -0.318998 -0.259428 -0.238178 -0.042543 -0.244466 0.214801 0.153901 0.080093 0.214020 -0.069579 -0.093560 0.056037 0.087723 0.207046 0.191728 0.210168 0.029010 0.149533
polarizability: 3.02906869e+02 1.66613886e+00 1.75394466e+02 4.86214674e+00 1.42327300e+00 8.61137265e+01
1716.lowfreq: -7.8799 -4.7856 -0.0007 -0.0005 0.0003 4.0739 16.8505 27.3127 36.5546
frequency: 16.6725 27.2225 36.4770 53.5405 66.5928 85.5399 94.7538 110.3554 132.8497 140.8688 147.4656 150.3307 167.4200 186.0716 194.2643 223.0594 247.6897 265.1182 291.7501 306.9037 326.3965 358.5249 381.7386 427.4166 460.5395 498.7923 533.9533 547.5617 577.2293 584.4556 596.2869 628.7477 661.3611 681.4313 733.2922 755.4409 789.1421 839.7010 847.3840 878.7753 926.6335 937.6430 950.6440 959.6045 985.1047 1015.5428 1030.6018 1050.5543 1068.6390 1105.5256 1110.7540 1111.6990 1147.0659 1150.7674 1155.2873 1170.5864 1183.1808 1208.7385 1241.1723 1259.5470 1306.2189 1322.7093 1372.7402 1377.7472 1423.6435 1429.6101 1437.7611 1453.4948 1456.2381 1459.2907 1460.6520 1472.1452 1477.2842 1484.1317 1508.2271 1550.5810 1600.8380 1631.7982 1646.6993 2974.7004 2982.5164 3001.6060 3077.3447 3086.1048 3110.5905 3123.0634 3127.0256 3130.8847 3157.1064 3163.1544 3171.2521 3177.6335 3520.3601
redmass: 5.8252 6.7655 3.0675 5.9817 4.2729 3.1785 2.6940 3.1712 1.8795 2.6542 2.4581 1.1906 2.7759 2.7788 1.4441 5.2159 5.1238 3.9182 7.8598 6.7563 5.7966 6.0075 5.5630 5.8387 5.4527 5.9247 4.2702 3.3653 3.6637 3.1684 3.0828 4.8237 2.3269 5.8215 6.8120 7.4375 6.9290 1.7032 4.7858 7.5191 2.1104 5.0521 9.1284 5.6523 1.3403 1.5316 2.0315 3.0215 2.1828 1.2449 1.2344 1.2379 1.4185 1.3472 1.4694 2.2568 1.7870 1.4498 2.0773 2.8745 1.9397 2.6317 7.3524 3.3734 1.2699 1.3823 1.2554 1.0562 1.0557 1.0620 1.0537 2.0034 1.1645 1.0569 9.9304 8.1387 7.1749 8.4923 6.2454 1.0311 1.0302 1.0284 1.1032 1.1044 1.1049 1.1035 1.1056 1.1038 1.0879 1.0948 1.0898 1.0969 1.0640
irintensity: 0.4686 1.2124 2.2479 1.1936 1.9510 2.0245 5.9412 9.1506 0.7331 0.4300 1.8533 0.8913 2.5078 1.5573 0.8567 0.8634 14.5245 14.8230 4.1383 4.9808 2.0440 1.1580 2.8227 19.1713 49.9061 8.1914 12.7757 17.9453 49.8441 46.3574 38.9489 4.9279 47.7499 22.3953 35.5473 25.3035 11.8116 44.0169 5.4635 4.0856 3.5190 15.9793 68.6361 46.5968 5.6863 65.1393 206.2767 98.9643 352.9389 0.3531 6.1274 2.0886 15.3486 1.9785 11.2134 24.3717 12.7728 23.9461 137.1951 194.2331 167.0028 419.9853 221.1668 94.7787 4.7833 22.2313 5.4548 16.8321 25.5856 1.7071 18.0712 9.7212 2.7373 26.1493 246.3650 30.5499 258.5284 182.0463 4.6324 65.7538 48.5623 78.9369 20.6632 19.9248 32.8666 19.6654 26.3449 11.7673 0.4531 0.1587 12.2930 6.5394 51.4877
temp: 298.150 k
press: 1.00000 atm
elementType: 8 8 8 8 8 8 6 6 6 6 6 6 6 6 6 6 6 6 6 1 1 1 1 1 1 1 1 1 1 1 1 1 1
symmnumber: 1
zpe: 648959.5 jmol-1
zpe.correction: 0.247176 hartree
zpe.thermalcorrener: 0.267488 hartree
zpe.thermalcorrenthalpy: 0.268432 hartree
zpe.thermalcorrgfe: 0.195720 hartree
zpe.sumelectzpe: -953.644342 hartree
zpe.sumelectthermal: -953.624030 hartree
zpe.sumelectthermalent: -953.623086 hartree
zpe.sumelectthermalfe: -953.695798 hartree
dipole: -3.8407 -3.6738 0.5090
dipole: 5.3392
quadrupole: -93.8143 -114.0822 -107.7038
quadrupole: 1.8871 1.4217 -1.9912
quadrupole: 11.3858 -8.8821 -2.5037 1.8871 1.4217 -1.9912
hfenergy: -953.8915179 hartree
pointgroup: C01 [X(C13H14O6)]
dipole: -1.7682167 0.4881026 -1.0235354 debye
polarizability: 293.2098264|37.9050932|147.2257377|0.9690303|-45.2462274|123.9794975 unknown
InChI: InChI=1S/C13H14O6/c1-17-10-6-4-8(9(14)5-7-11(15)16)12(18-2)13(10)19-3/h4-7,15H,1-3H3
charge 0 multiplicity 1
33 atoms
O  -0.299859 0.814613 -1.019907
O  -3.054537 0.354201 -0.928822
O  -4.061289 -1.747643 0.918588
O  2.285015 -1.529358 1.490212
O  5.684848 1.679316 -0.265397
O  3.751086 2.737673 -1.014368
C  0.101906 -0.85258 0.752858
C  -0.786776 -0.161502 -0.124441
C  -2.19389 -0.391988 -0.08501
C  -2.726028 -1.389243 0.782272
C  -0.472142 -1.819358 1.63362
C  -1.83992 -2.093483 1.645268
C  1.588336 -0.682381 0.83583
C  2.260027 0.49514 0.19713
C  -0.439863 0.492861 -2.46306
C  -3.177181 1.785575 -0.551099
C  -5.075986 -1.409351 -0.100861
C  3.619387 0.606814 0.199386
C  4.290524 1.771898 -0.41906
H  0.214161 -2.357305 2.29461
H  -2.269954 -2.84477 2.313374
H  1.63819 1.263197 -0.271201
H  -1.502836 0.352944 -2.724037
H  0.141974 -0.416287 -2.701953
H  -0.017684 1.360437 -2.991491
H  -2.192592 2.28214 -0.600526
H  -3.599393 1.877312 0.467543
H  -3.866229 2.224389 -1.288835
H  -4.71367 -1.644653 -1.114974
H  -5.351857 -0.343694 -0.051198
H  -5.937314 -2.042455 0.162831
H  4.247594 -0.162629 0.660036
H  6.111355 2.474171 -0.686723
