program: Gaussian 09
title: 000224421
version: EM64L-G09RevD.01
frameworkgroup: C1[X(C15H10BrN)]
method: RPBEPBE
basis: SDD
operation: Freq
keyword: #p
keyword: freq=noraman
keyword: PBEPBE/SDD
title: #p freq=noraman PBEPBE/SDD
converged: NO YES NO NO
title: Mulliken charges:
elementType: Br N C C C C C C C C C C C C C C C H H H H H H H H H H
charge: 0.027623 0.011338 0.415023 -0.022845 -0.072422 0.323194 -0.227833 -0.287520 -0.387747 -0.320831 -0.353402 -0.353313 -0.245345 -0.218791 -0.222939 -0.222922 -0.236297 0.263109 0.238337 0.267574 0.237123 0.237113 0.233355 0.235248 0.227221 0.227226 0.228725
chargesum: 0.00000
title: Mulliken charges with hydrogens summed into heavy atoms:
elementType: Br N C C C C C C C C C C C C C C C
charge: 0.027623 0.011338 0.415023 -0.022845 -0.072422 0.323194 0.035276 -0.287520 -0.149410 -0.053257 -0.116279 -0.116200 -0.011991 0.016457 0.004282 0.004304 -0.007572
polarizability: 2.91983856e+02 -1.14953002e+01 1.65882456e+02 -2.02398833e-02 6.36917466e-02 1.09202146e+02
1716.lowfreq: -44.1037 -0.0005 -0.0004 -0.0004 3.8034 5.4020 8.2410 51.9212 56.3327
frequency: -44.0576 51.8031 56.3244 80.8589 146.7232 170.0286 219.0732 247.5459 270.5969 279.9365 353.7248 394.4351 424.4512 433.7589 477.5699 535.0484 554.2225 563.9514 581.2176 613.2594 613.5172 688.5252 702.3433 727.0642 755.9118 765.7308 781.5535 797.7123 850.0609 866.0382 873.2241 915.4802 922.0351 927.2915 970.6371 973.2958 988.7128 995.6948 998.5879 1016.1260 1022.4333 1070.1693 1079.5263 1121.7032 1167.7975 1172.6493 1187.6642 1204.1436 1242.9161 1261.2217 1289.5502 1311.2435 1341.3430 1372.4235 1386.4292 1409.0192 1428.8827 1444.3297 1478.4265 1490.4258 1538.9013 1576.6240 1587.2604 1614.4443 1620.8509 3123.9455 3127.1514 3130.4407 3140.5454 3141.5727 3151.3939 3153.3871 3158.3690 3165.4704 3173.4515
redmass: 3.8782 4.7397 6.9389 5.9784 7.9792 4.6077 7.3059 5.3499 6.2751 6.6710 5.1164 2.8069 4.4069 4.4085 2.9418 5.6539 3.6375 5.7504 5.6988 6.3678 7.8522 6.4781 1.6907 6.3659 2.7524 1.2946 3.0642 3.4564 1.2476 6.0523 1.4293 1.5839 1.5627 4.8434 1.3797 1.3924 6.2563 1.3179 1.3306 2.2383 2.6452 2.6434 1.5996 1.6851 1.1111 1.0528 1.1148 1.7569 2.1631 2.6861 2.6222 1.3530 5.0418 7.3088 2.3013 5.4798 2.2020 3.2350 3.0970 2.9623 7.3442 7.1999 6.0624 6.2694 6.5190 1.0844 1.0867 1.0877 1.0899 1.0926 1.0970 1.0931 1.0954 1.1018 1.0992
irintensity: 0.0487 1.1720 0.9040 0.5933 0.1260 0.0991 0.8375 1.1873 0.8547 3.0899 0.8828 0.0154 2.5327 0.7493 10.2732 8.1283 0.0046 2.0215 22.9212 0.0957 4.1557 3.2269 50.3277 1.5646 34.7095 66.8520 4.8614 12.5405 0.0114 22.3071 10.3456 18.4768 10.9433 41.8051 5.0762 0.0174 1.7201 0.0483 0.1222 2.1624 30.6070 26.3794 8.3167 12.5060 0.8443 0.0132 1.7192 1.3479 4.1803 25.5165 12.0105 0.5694 7.7910 0.0040 69.9894 1.1024 8.6402 6.3344 22.7596 2.3026 13.7295 21.5440 0.9152 0.2450 0.8054 1.2364 1.4428 0.2692 10.5469 19.7482 37.3889 2.0393 24.3091 24.8660 21.3732
temp: 298.150 k
press: 1.00000 atm
elementType: 35 7 6 6 6 6 6 6 6 6 6 6 6 6 6 6 6 1 1 1 1 1 1 1 1 1 1
symmnumber: 1
zpe: 529169.2 jmol-1
zpe.correction: 0.201550 hartree
zpe.thermalcorrener: 0.214059 hartree
zpe.thermalcorrenthalpy: 0.215003 hartree
zpe.thermalcorrgfe: 0.161155 hartree
zpe.sumelectzpe: -644.665340 hartree
zpe.sumelectthermal: -644.652832 hartree
zpe.sumelectthermalent: -644.651887 hartree
zpe.sumelectthermalfe: -644.705735 hartree
dipole: 1.9912 0.4917 0.0000
dipole: 2.0510
quadrupole: -84.9307 -106.8058 -105.1299
quadrupole: 4.5970 -0.0076 0.0211
quadrupole: 14.0248 -7.8504 -6.1744 4.5970 -0.0076 0.0211
hfenergy: -644.8668903 hartree
pointgroup: C01 [X(C15H10Br1N1)]
dipole: 0.8000939 0.1049134 0.0001093 debye
polarizability: 287.8711831|-25.1761494|169.9948174|-0.0568943|0.1524994|109.2024569 unknown
InChI: InChI=1S/C15H10BrN/c16-13-10-12-8-4-5-9-14(12)17-15(13)11-6-2-1-3-7-11/h1-10H
charge 0 multiplicity 1
27 atoms
Br -1.170518 3.022897 0.003352
N  0.438323 -0.889102 -0.000876
C  2.367522 0.674944 0.000836
C  -0.418048 0.15385 0.000382
C  1.807862 -0.659779 -0.00068
C  -1.887023 -0.158774 0.000101
C  1.447503 1.772397 0.002089
C  0.079444 1.510507 0.001869
C  3.789613 0.843379 0.000978
C  2.687448 -1.787864 -0.002004
C  -2.582908 -0.318967 -1.223182
C  -2.5840 -0.316327 1.22311
C  4.625679 -0.276128 -0.000327
C  4.072084 -1.597293 -0.001823
C  -3.961172 -0.62913 -1.223066
C  -3.962246 -0.626548 1.222436
C  -4.654839 -0.78246 -0.000457
H  1.821353 2.801269 0.003159
H  4.210923 1.855551 0.002121
H  2.237946 -2.78535 -0.003131
H  -2.04567 -0.204258 -2.171384
H  -2.047633 -0.199522 2.171553
H  5.713607 -0.14819 -0.000215
H  4.744262 -2.462123 -0.002829
H  -4.490608 -0.752246 -2.17446
H  -4.492514 -0.747671 2.173622
H  -5.723895 -1.023259 -0.000671
