program: Gaussian 09
title: 000224418
version: EM64L-G09RevD.01
frameworkgroup: C1[X(C15H9Br2N)]
method: RPBEPBE
basis: SDD
operation: Freq
keyword: #p
keyword: freq=noraman
keyword: PBEPBE/SDD
title: #p freq=noraman PBEPBE/SDD
converged: NO YES NO NO
title: Mulliken charges:
elementType: Br Br N C C C C C C C C C C C C C C C H H H H H H H H H
charge: 0.066466 0.086344 0.023522 0.440668 -0.092340 -0.037379 0.319528 -0.191560 -0.270813 -0.335839 -0.313093 -0.345341 -0.345351 -0.250638 -0.224567 -0.224051 -0.224051 -0.235447 0.246113 0.271875 0.237349 0.237349 0.236384 0.238252 0.228430 0.228430 0.229761
chargesum: 0.00000
title: Mulliken charges with hydrogens summed into heavy atoms:
elementType: Br Br N C C C C C C C C C C C C C C C
charge: 0.066466 0.086344 0.023522 0.440668 -0.092340 -0.037379 0.319528 -0.191560 -0.270813 -0.089726 -0.041218 -0.107992 -0.108002 -0.014254 0.013685 0.004379 0.004379 -0.005686
polarizability: 2.94041266e+02 2.69786173e+01 2.16232677e+02 -3.31830214e-03 1.18021161e-03 1.14784363e+02
1716.lowfreq: -40.7793 -7.4191 -2.4585 -0.0007 0.0001 0.0006 5.1801 31.9938 55.9434
frequency: -40.7749 31.9496 55.9396 65.1298 102.0630 136.6591 168.2479 186.1524 209.3763 227.0374 268.2120 284.2007 329.7572 352.6488 395.0879 451.4350 453.9754 540.2499 548.8867 580.7947 581.0485 586.7117 613.5472 639.5281 701.5731 717.3506 720.3855 766.0800 776.5431 791.4021 806.6508 849.3493 866.6114 884.9826 922.6164 942.4850 973.2874 973.6764 988.4936 996.0185 999.9878 1022.6277 1026.2324 1079.2842 1092.4760 1124.2012 1171.2999 1172.9210 1188.1630 1228.1136 1260.9108 1279.4290 1312.2723 1329.2257 1345.5810 1372.0492 1384.4954 1428.8721 1440.2231 1462.6395 1486.1726 1532.2097 1552.2832 1587.0866 1612.2363 1617.5212 3124.2026 3130.3101 3138.3097 3141.2557 3151.1752 3152.6129 3165.4536 3167.6863 3176.9438
redmass: 3.8336 12.1232 6.6399 5.9634 4.8139 56.1576 8.1381 5.2800 15.0646 5.5077 7.8836 7.6020 7.5711 5.1504 2.8013 4.5350 3.9642 3.9678 7.7120 7.9886 5.6702 4.6139 6.3940 7.2922 1.7116 6.5781 6.3794 2.2218 1.3065 4.2828 5.3645 1.2481 6.4146 1.5928 1.4706 7.8311 1.3672 1.3816 6.2752 1.3193 1.3306 2.4754 2.1787 1.6009 3.5440 1.7806 1.1566 1.0524 1.1151 2.3383 2.7997 3.0819 1.3513 4.8930 3.7132 7.2890 5.5867 2.2042 2.7843 3.1051 2.6713 8.8143 7.7094 6.0748 6.1999 6.4140 1.0845 1.0878 1.0861 1.0926 1.0970 1.0897 1.1018 1.0951 1.1000
irintensity: 0.0034 0.0706 0.7084 1.4730 0.1879 0.1386 0.3292 0.8605 1.2213 0.5932 0.0216 2.4989 0.5163 1.3894 0.0172 2.4784 3.0859 1.4644 9.1813 9.8322 1.0086 13.6271 0.0455 25.0120 49.2116 19.1346 0.4632 41.5394 93.7606 0.3217 10.5042 0.0189 24.1837 0.0943 1.1123 15.6047 1.1580 0.6853 2.1327 0.0306 0.0530 3.7583 26.3692 8.6478 47.4108 0.4417 0.9700 0.0117 2.1421 12.3896 26.2009 6.7313 0.5863 87.9755 47.4075 0.0167 22.3464 8.9105 10.3602 37.6390 3.6901 26.5993 34.1713 0.9267 0.7554 1.3607 1.3792 0.1547 3.3574 18.3939 35.4498 7.3758 26.2090 9.6115 22.7503
temp: 298.150 k
press: 1.00000 atm
elementType: 35 35 7 6 6 6 6 6 6 6 6 6 6 6 6 6 6 6 1 1 1 1 1 1 1 1 1
symmnumber: 1
zpe: 502088.3 jmol-1
zpe.correction: 0.191235 hartree
zpe.thermalcorrener: 0.205348 hartree
zpe.thermalcorrenthalpy: 0.206292 hartree
zpe.thermalcorrgfe: 0.147871 hartree
zpe.sumelectzpe: -657.448044 hartree
zpe.sumelectthermal: -657.433932 hartree
zpe.sumelectthermalent: -657.432987 hartree
zpe.sumelectthermalfe: -657.491409 hartree
dipole: 1.1156 1.0719 0.0000
dipole: 1.5471
quadrupole: -100.6268 -120.1570 -119.3311
quadrupole: 6.5413 0.0001 -0.0014
quadrupole: 12.7448 -6.7853 -5.9595 6.5413 0.0001 -0.0014
hfenergy: -657.6392794 hartree
pointgroup: C01 [X(C15H9Br2N1)]
dipole: 0.4929946 -0.3569932 0.0002133 debye
polarizability: 299.9417115|-15.2945961|210.3322043|0.0268627|-0.0492833|114.7843906 unknown
InChI: InChI=1S/C15H9Br2N/c16-13-11-8-4-5-9-12(11)18-15(14(13)17)10-6-2-1-3-7-10/h1-9H
charge 0 multiplicity 1
27 atoms
Br 2.240192 3.281854 -0.001779
Br -1.169744 2.866044 -0.001763
N  0.254091 -1.087429 0.000327
C  2.292707 0.347663 -0.000255
C  1.632905 -0.94516 0.000366
C  -0.526553 0.006975 -0.000302
C  -2.013181 -0.212188 -0.000331
C  1.43305 1.502049 -0.000913
C  0.042259 1.341852 -0.000932
C  3.723688 0.390743 -0.000171
C  2.422203 -2.137778 0.00105
C  -2.715914 -0.332756 -1.224063
C  -2.716104 -0.331864 1.223379
C  4.467032 -0.792235 0.000504
C  3.816454 -2.065902 0.001121
C  -4.109091 -0.566245 -1.223373
C  -4.109282 -0.565353 1.222642
C  -4.809645 -0.68138 -0.000378
H  4.229428 1.360802 -0.000638
H  1.886171 -3.091383 0.001504
H  -2.173356 -0.247624 -2.172423
H  -2.173694 -0.246046 2.171761
H  5.561203 -0.744098 0.000559
H  4.416389 -2.981977 0.001649
H  -4.644732 -0.659658 -2.174652
H  -4.64507 -0.658069 2.173906
H  -5.890505 -0.861739 -0.000397
