program: Gaussian 09
title: 000217918
version: EM64L-G09RevD.01
frameworkgroup: C1[X(C22H25NO3)]
method: RPBEPBE
basis: SDD
operation: Freq
keyword: #p
keyword: freq=noraman
keyword: PBEPBE/SDD
title: #p freq=noraman PBEPBE/SDD
converged: YES YES NO NO
title: Mulliken charges:
elementType: O O O N C C C C C C C C C C C C C C C C C C C C C C H H H H H H H H H H H H H H H H H H H H H H H H H
charge: -0.324863 -0.245922 -0.263138 -0.088261 -0.060119 -0.373915 0.027148 -0.355931 -0.374670 -0.377494 -0.395294 -0.387811 -0.398885 0.300748 0.287361 0.323749 0.158265 -0.526050 -0.365072 -0.343543 -0.414927 -0.359808 -0.234912 -0.265815 -0.236694 -0.225061 0.221477 0.228781 0.204431 0.176682 0.205445 0.218375 0.173709 0.217122 0.250590 0.194018 0.203255 0.202959 0.194550 0.215960 0.190531 0.221706 0.261005 0.275847 0.264197 0.237944 0.251044 0.229028 0.225076 0.229852 0.227328
chargesum: 0.00000
title: Mulliken charges with hydrogens summed into heavy atoms:
elementType: O O O N C C C C C C C C C C C C C C C C C C C C C C
charge: -0.324863 -0.245922 -0.263138 -0.088261 0.161358 0.059297 0.027148 0.026196 0.017415 0.090219 0.001978 0.009697 0.007606 0.300748 0.287361 0.323749 0.158265 -0.043339 -0.089225 -0.079346 -0.176982 -0.108763 -0.005885 -0.040739 -0.006841 0.002267
polarizability: 2.76661254e+02 5.59492920e+00 2.72517751e+02 -2.25772974e+01 -2.39748826e+00 1.93075570e+02
1716.lowfreq: -6.5254 -3.0401 0.0006 0.0007 0.0009 9.3493 16.2959 28.2290 35.7361
frequency: 14.3574 27.9293 35.6191 40.8649 77.1209 79.0461 97.5246 118.2337 146.2370 160.8251 189.3942 192.5288 238.8103 255.0422 276.3161 286.7802 297.3658 319.5432 338.2737 343.3088 357.1663 360.0269 375.8243 422.8115 428.9745 452.2759 454.1723 466.1049 487.4251 503.1153 538.0415 548.0608 554.7858 574.5802 620.3703 626.8114 654.4876 697.0857 705.9735 724.9354 752.7318 756.5882 763.7985 766.8239 774.1915 802.0970 825.0979 844.0112 851.6239 857.0283 859.2510 875.5022 890.9459 898.5589 909.2070 923.2849 928.6106 952.0297 956.2083 962.3124 965.3719 973.1285 984.3608 989.8934 993.1120 995.0976 999.1346 1038.9236 1044.6054 1046.6970 1054.4873 1075.7173 1101.9508 1104.8443 1114.6525 1118.6080 1127.6251 1147.8368 1156.4232 1162.8480 1167.9568 1170.3401 1186.5013 1194.7615 1208.3910 1215.8211 1229.3379 1236.2093 1245.3316 1259.7313 1265.1721 1273.9763 1284.0525 1286.1534 1291.7897 1320.6603 1325.0671 1329.9133 1338.1522 1345.0067 1350.0022 1358.9092 1369.8628 1377.6002 1387.6416 1389.8313 1429.4434 1439.9976 1452.0952 1458.4997 1460.5535 1463.1741 1464.7684 1469.2070 1473.3674 1474.9487 1477.4491 1479.5754 1574.7388 1592.0092 1612.3163 1615.1569 2827.3845 2836.2026 2895.6054 2968.5442 2984.9617 2985.3822 2998.8334 3022.4507 3023.5120 3026.3013 3029.5481 3037.1220 3046.0695 3046.6528 3055.1422 3101.6987 3114.0573 3121.7159 3131.6219 3134.6217 3150.2029 3155.2782 3167.0811 3170.5913 3179.5345
redmass: 5.1554 3.9316 3.2340 5.0535 3.8213 4.1851 3.3796 4.3520 4.7731 4.0475 4.0303 3.9771 1.8345 4.5209 5.1033 2.4486 5.3736 4.1160 5.1999 4.3961 2.7072 3.5198 1.7591 2.1629 3.7625 2.8500 3.2896 3.8216 3.3774 3.7216 4.3620 3.6885 4.0510 2.7471 4.5772 6.5702 6.5532 4.6334 6.6812 4.1063 3.3604 4.1834 1.3882 2.3915 1.9403 1.4747 3.8539 1.8284 2.8281 1.9813 1.9960 2.1110 1.8427 2.2477 3.2670 3.7437 5.2354 4.2361 1.3314 1.4191 1.7478 2.5275 1.3326 2.0330 2.7694 2.4249 1.4972 2.1411 2.0511 2.1150 1.8503 1.6284 1.9046 1.9769 1.8494 2.1435 1.9792 1.3356 2.1357 1.2837 1.1445 1.0750 2.3592 2.2855 1.9540 2.1237 1.4169 1.8504 1.5290 1.2801 1.1912 1.7558 1.4276 1.3952 1.4045 1.2660 1.4158 1.3112 1.4346 1.4917 1.4659 1.4824 1.4108 7.3676 1.4656 5.1189 2.3229 2.3651 1.0898 1.0869 1.0853 1.9747 1.0878 1.0881 1.2997 1.5766 1.5069 1.0978 7.0269 7.0189 6.8106 6.7102 1.0717 1.0702 1.0691 1.0624 1.0626 1.0600 1.0661 1.0612 1.0862 1.0885 1.0878 1.0947 1.1014 1.0926 1.1038 1.1045 1.1007 1.0869 1.0857 1.0898 1.0912 1.0955 1.0957 1.0971 1.0961
irintensity: 0.1196 0.1698 0.0404 0.8569 0.3533 0.4622 0.0715 2.3460 1.2985 0.4100 3.9159 3.5409 0.5794 2.4588 3.0878 4.5485 3.5399 3.0408 0.9308 12.6402 3.2606 5.1461 2.5346 5.7305 1.7297 0.1877 3.2087 0.8520 4.3974 2.1885 0.7659 4.9605 0.5564 2.6853 15.5863 14.1096 2.8672 1.2251 1.6084 2.4931 21.1495 4.1702 94.7422 57.6956 26.1794 0.0867 7.3729 19.5435 7.3218 7.7559 1.2962 15.3688 1.3552 6.8200 7.1310 34.9350 42.0526 53.6383 3.4291 8.6986 41.4148 13.9252 4.7472 27.0920 110.3932 35.2539 19.6082 7.4860 19.5127 2.7181 77.4398 14.1694 19.3775 33.5395 32.4281 2.8732 2.1792 6.9847 57.5516 28.3234 5.4008 0.1319 49.5607 63.4192 13.5006 15.4014 5.9381 38.3948 12.3704 2.9646 4.6574 80.1219 2.4580 3.9121 6.9851 5.2067 13.4035 1.5891 0.5406 1.1402 0.7299 15.8579 1.9522 10.2215 3.1240 1.1919 54.1959 4.2261 7.2442 14.6028 10.9652 14.6995 5.0358 7.9993 37.3191 2.0545 16.7245 8.2312 22.9639 1.8960 4.8691 30.3058 43.6812 140.5950 81.5540 39.4262 26.3746 35.8034 32.1743 35.1304 57.0537 47.9059 16.3703 42.5560 47.5160 33.1207 95.1435 10.4533 13.4349 3.9163 5.9111 14.6292 17.8316 26.1549 13.2078 18.0386 16.2657
temp: 298.150 k
press: 1.00000 atm
elementType: 8 8 8 7 6 6 6 6 6 6 6 6 6 6 6 6 6 6 6 6 6 6 6 6 6 6 1 1 1 1 1 1 1 1 1 1 1 1 1 1 1 1 1 1 1 1 1 1 1 1 1
symmnumber: 1
zpe: 1112461.0 jmol-1
zpe.correction: 0.423714 hartree
zpe.thermalcorrener: 0.445562 hartree
zpe.thermalcorrenthalpy: 0.446506 hartree
zpe.thermalcorrgfe: 0.371480 hartree
zpe.sumelectzpe: -1131.817606 hartree
zpe.sumelectthermal: -1131.795758 hartree
zpe.sumelectthermalent: -1131.794814 hartree
zpe.sumelectthermalfe: -1131.869840 hartree
dipole: 2.9800 -1.9416 -0.1549
dipole: 3.5600
quadrupole: -143.5341 -142.6018 -152.6033
quadrupole: 6.6163 -4.5593 -1.3545
quadrupole: 2.7123 3.6446 -6.3569 6.6163 -4.5593 -1.3545
hfenergy: -1132.2413202 hartree
pointgroup: C01 [X(C22H25N1O3)]
dipole: -1.1919547 0.7293359 0.0951681 debye
polarizability: 277.6507693|2.4226168|269.7253009|20.6718814|15.7068477|194.8785047 unknown
InChI: InChI=1S/C22H25NO3/c1-6-12-23(13-7-1)14-18-16-25-22(26-18)19-9-3-2-8-17(19)15-24-21-11-5-4-10-20(21)22/h2-5,8-11,18H,1,6-7,12-16H2
charge 0 multiplicity 1
51 atoms
O  -0.261815 0.317646 -1.060077
O  0.184369 -0.134269 1.201119
O  3.631777 -0.933258 1.021486
N  -3.819126 -0.181646 0.114541
C  -1.496446 0.626458 -0.280461
C  -2.504354 -0.523611 -0.476218
C  0.855278 0.084197 -0.123044
C  -4.663851 0.628973 -0.801474
C  -4.556134 -1.366409 0.629375
C  -0.996441 0.759778 1.171817
C  -5.943686 1.119187 -0.09411
C  -5.831619 -0.937124 1.382539
C  -6.74085 -0.076057 0.476158
C  1.742441 1.338929 -0.068329
C  1.606515 -1.19381 -0.505122
C  2.806481 1.401412 0.875601
C  2.864339 -1.593164 0.044901
C  3.070217 0.218112 1.776977
C  1.526018 2.422423 -0.947937
C  1.022499 -2.038574 -1.487552
C  3.617999 2.556698 0.933571
C  3.48883 -2.788226 -0.40094
C  2.340124 3.57643 -0.879876
C  1.638938 -3.224394 -1.925906
C  3.38593 3.648961 0.066553
C  2.888071 -3.600256 -1.376318
H  -1.901827 1.578761 -0.666888
H  -2.099346 -1.42006 0.02915
H  -2.570733 -0.759453 -1.565542
H  -4.950046 0.030211 -1.706999
H  -4.075462 1.493982 -1.159943
H  -3.883999 -1.925381 1.306457
H  -4.841667 -2.060471 -0.205045
H  -0.702534 1.798107 1.416982
H  -1.722957 0.378616 1.904273
H  -6.560959 1.695741 -0.809729
H  -5.657928 1.801563 0.729743
H  -5.537621 -0.350949 2.274879
H  -6.370392 -1.83788 1.734209
H  -7.624661 0.279252 1.038667
H  -7.118535 -0.6980 -0.361987
H  3.857737 0.441788 2.513258
H  2.150677 -0.113189 2.291248
H  0.724513 2.343966 -1.687827
H  0.071733 -1.717528 -1.919871
H  4.439363 2.597594 1.659079
H  4.450481 -3.050985 0.050609
H  2.160605 4.411616 -1.56605
H  1.15736 -3.842502 -2.690679
H  4.019876 4.540678 0.123806
H  3.389221 -4.517888 -1.703878
