program: Gaussian 09
title: 000217916
version: EM64L-G09RevD.01
frameworkgroup: C1[X(C21H23NO3)]
method: RPBEPBE
basis: SDD
operation: Freq
keyword: #p
keyword: freq=noraman
keyword: PBEPBE/SDD
title: #p freq=noraman PBEPBE/SDD
converged: NO YES NO NO
title: Mulliken charges:
elementType: O O O N C C C C C C C C C C C C C C C C C C C C C H H H H H H H H H H H H H H H H H H H H H H H
charge: -0.325537 -0.248035 -0.263133 -0.087160 -0.057632 -0.360405 0.028660 -0.438987 -0.422390 -0.376745 -0.441428 -0.442223 0.304048 0.287195 0.321377 0.160172 -0.525890 -0.367092 -0.344147 -0.414817 -0.359919 -0.233917 -0.266427 -0.236578 -0.225199 0.220271 0.228034 0.208416 0.213355 0.235843 0.211248 0.232193 0.216163 0.255222 0.218667 0.226558 0.226980 0.222040 0.221300 0.261941 0.276133 0.262649 0.237834 0.250971 0.228821 0.224741 0.229690 0.227141
chargesum: 0.00000
title: Mulliken charges with hydrogens summed into heavy atoms:
elementType: O O O N C C C C C C C C C C C C C C C C C C C C C
charge: -0.325537 -0.248035 -0.263133 -0.087160 0.162638 0.076045 0.028660 0.010211 0.021052 0.094639 0.003797 0.006797 0.304048 0.287195 0.321377 0.160172 -0.042649 -0.090958 -0.081498 -0.176983 -0.108949 -0.005096 -0.041686 -0.006888 0.001942
polarizability: 2.67443175e+02 1.34735974e+01 2.59442933e+02 -2.20581299e+01 1.76434718e+00 1.79170471e+02
1716.lowfreq: -8.4492 -5.5515 0.0007 0.0009 0.0009 11.1986 18.8200 29.7807 34.8839
frequency: 17.4215 29.4305 34.7761 45.0321 71.2871 75.6659 82.7679 106.2798 118.0773 155.4794 170.8369 190.0061 197.5486 263.0535 278.0122 297.7845 318.4004 338.2021 343.6673 359.9059 389.8962 400.3830 429.1105 454.1725 464.9263 483.2279 503.7150 538.3784 554.2509 555.1545 614.5909 621.5169 627.1437 648.4665 655.7199 698.2086 708.1915 725.3464 754.2742 756.6187 763.7178 768.9872 774.2509 824.4105 828.5287 846.0063 857.3167 859.7943 875.4868 877.3928 893.0403 901.8916 910.3292 921.1962 927.4198 936.1092 952.2456 962.0921 966.1543 969.9648 983.2915 990.3916 993.0491 1000.0457 1023.1049 1040.3395 1044.9560 1048.2178 1064.0807 1073.3739 1082.2289 1104.9539 1116.2176 1137.3762 1165.4842 1170.8047 1172.0210 1175.5069 1187.1907 1195.7261 1203.8508 1215.1034 1217.5399 1230.2991 1233.6303 1241.2090 1255.7073 1270.3802 1276.1880 1284.7867 1286.5995 1298.7081 1315.8976 1317.7520 1320.2325 1334.9229 1359.1436 1365.1177 1377.5807 1390.1351 1430.0662 1440.4900 1459.4787 1463.1651 1465.4347 1470.5193 1473.2553 1476.1692 1478.2061 1479.1791 1489.0635 1574.5030 1592.6913 1612.7573 1615.3790 2909.8071 2984.6942 2995.3861 2998.6156 3004.4047 3019.3357 3023.9077 3028.7366 3048.1171 3054.6822 3069.2692 3077.0441 3090.1681 3101.4252 3116.8213 3121.6433 3131.1573 3134.6962 3150.0257 3155.8719 3166.5357 3172.0759 3179.1285
redmass: 5.1303 3.2404 3.7510 4.9165 2.6104 2.5374 3.7125 2.8693 4.1982 4.3674 4.6964 5.1415 3.3804 4.3216 5.3578 5.7739 4.6746 5.0527 3.5084 3.6361 2.5559 2.1063 2.2421 3.5365 3.8250 5.4792 4.2188 4.4256 4.4008 5.2516 2.2150 4.5015 6.5473 3.6169 5.6717 5.0302 5.5208 4.0665 2.8046 4.0245 1.3053 1.6744 1.8206 2.7867 2.7297 2.3493 1.9827 2.4891 2.3046 3.3723 1.8440 2.6628 2.7365 3.7955 4.7325 1.6554 4.5892 1.4199 1.8268 2.2903 1.3449 2.5434 2.3769 1.4081 2.7579 2.2033 2.0850 2.3195 1.9477 2.0088 1.7064 1.9467 1.8658 1.7784 1.1096 1.1328 1.2409 1.5141 1.9577 2.1401 1.6128 2.5298 1.2262 1.6206 1.2727 1.8297 1.3323 1.4314 1.6000 1.2947 1.3560 1.3163 1.2382 1.2613 1.5797 1.3760 1.4881 1.4131 6.9949 5.6483 2.3373 2.3719 1.0791 2.1313 1.0825 1.0815 1.1022 2.1729 1.1063 1.3346 1.0941 7.0132 7.0089 6.8159 6.7195 1.0682 1.0661 1.0627 1.0665 1.0595 1.0642 1.0606 1.0859 1.0937 1.1012 1.1018 1.1011 1.1058 1.1050 1.1006 1.0870 1.0857 1.0899 1.0910 1.0959 1.0956 1.0966 1.0961
irintensity: 0.2096 0.1973 0.2911 0.8315 0.2453 0.5732 0.3882 0.2310 1.7765 1.8068 0.2768 1.1768 8.3181 5.3755 2.6031 2.9751 2.7506 2.5506 5.9457 1.3857 11.1413 2.0496 5.9594 1.9404 1.4001 7.0926 3.1564 0.7287 4.3613 6.1787 3.6098 15.4911 14.5022 4.1599 1.7724 0.8852 2.5266 2.8251 15.6328 4.4864 104.6952 55.7310 27.5928 6.2235 7.2401 20.1775 6.0753 4.5044 20.2581 10.5205 2.6998 11.0474 0.3927 30.3446 46.7868 10.3853 56.9844 10.2495 27.3272 14.6168 8.9991 78.0337 75.8252 5.9513 7.6763 9.6922 15.2144 18.4711 105.8470 11.2601 24.1272 23.9273 24.5803 7.8086 18.8711 11.6429 3.1678 26.4412 42.2873 57.6363 16.0999 13.3227 3.9322 8.3563 19.7363 31.3585 7.9716 33.6700 43.2895 2.5170 3.1471 3.6433 7.7124 4.5176 12.5551 1.1193 17.6663 0.9461 10.7917 1.0599 54.6744 4.5177 14.7877 19.0214 0.6733 12.6267 13.7207 10.8210 13.0024 20.4885 6.5518 22.3002 1.6494 6.8469 29.6394 52.2834 49.1684 32.2824 35.6940 41.1995 54.7600 37.2851 29.1241 26.8358 22.9330 1.0130 20.1593 110.4363 9.4896 10.3022 4.1820 6.1433 14.9891 17.2826 27.8433 13.1561 16.6533 16.2370
temp: 298.150 k
press: 1.00000 atm
elementType: 8 8 8 7 6 6 6 6 6 6 6 6 6 6 6 6 6 6 6 6 6 6 6 6 6 1 1 1 1 1 1 1 1 1 1 1 1 1 1 1 1 1 1 1 1 1 1 1
symmnumber: 1
zpe: 1037822.1 jmol-1
zpe.correction: 0.395286 hartree
zpe.thermalcorrener: 0.416316 hartree
zpe.thermalcorrenthalpy: 0.417260 hartree
zpe.thermalcorrgfe: 0.343510 hartree
zpe.sumelectzpe: -1092.586394 hartree
zpe.sumelectthermal: -1092.565363 hartree
zpe.sumelectthermalent: -1092.564419 hartree
zpe.sumelectthermalfe: -1092.638169 hartree
dipole: 2.8292 -2.0285 -0.2295
dipole: 3.4888
quadrupole: -131.4213 -137.7063 -147.2369
quadrupole: 6.4354 -4.2273 0.0246
quadrupole: 7.3669 1.0819 -8.4487 6.4354 -4.2273 0.0246
hfenergy: -1092.9816792 hartree
pointgroup: C01 [X(C21H23N1O3)]
dipole: -1.1902759 0.6805717 0.0639371 debye
polarizability: 266.3432801|10.9924526|260.2494335|20.4716426|12.7541127|179.4638651 unknown
InChI: InChI=1S/C21H23NO3/c1-2-8-18-16(7-1)14-23-20-10-4-3-9-19(20)21(18)24-15-17(25-21)13-22-11-5-6-12-22/h1-4,7-10,17H,5-6,11-15H2
charge 0 multiplicity 1
48 atoms
O  -0.656813 0.499261 -0.842851
O  0.02033 0.054615 1.363731
O  3.34929 -0.986299 0.838003
N  -4.045287 0.153875 0.794416
C  -1.781464 0.862437 0.068559
C  -2.841102 -0.257141 0.025874
C  0.544017 0.204963 -0.033209
C  -4.848286 -0.975866 1.344387
C  -5.04036 0.923361 -0.013874
C  -1.109375 1.009472 1.446992
C  -5.794905 -1.434274 0.189111
C  -6.038694 -0.125958 -0.632534
C  1.514241 1.394679 -0.116377
C  1.160701 -1.129569 -0.462958
C  2.682195 1.40016 0.697966
C  2.437371 -1.609128 -0.032338
C  2.960278 0.226111 1.606779
C  1.273127 2.470393 -0.998802
C  0.420514 -1.947337 -1.358733
C  3.576045 2.491999 0.623363
C  2.923513 -2.857584 -0.503377
C  2.170978 3.560745 -1.063663
C  0.901211 -3.185125 -1.823143
C  3.323778 3.576281 -0.248012
C  2.168345 -3.642796 -1.3893
H  -2.205233 1.817293 -0.291935
H  -2.403571 -1.158827 0.492693
H  -3.053419 -0.501762 -1.040848
H  -5.450765 -0.595086 2.192372
H  -4.191796 -1.775266 1.726343
H  -4.529905 1.531246 -0.780858
H  -5.585377 1.613912 0.656557
H  -0.738321 2.037003 1.623005
H  -1.764424 0.685187 2.268506
H  -6.732532 -1.875774 0.569443
H  -5.293123 -2.196985 -0.433367
H  -5.841398 -0.287303 -1.706636
H  -7.081089 0.226443 -0.539105
H  3.839379 0.410559 2.243604
H  2.082434 -0.019905 2.229944
H  0.383863 2.435437 -1.634132
H  -0.54374 -1.564953 -1.702515
H  4.476887 2.489791 1.248725
H  3.904955 -3.182441 -0.144169
H  1.972252 4.390796 -1.750802
H  0.300988 -3.780978 -2.518518
H  4.023005 4.418466 -0.294334
H  2.565183 -4.602826 -1.737786
