program: Gaussian 09
title: 000224411
version: EM64L-G09RevD.01
frameworkgroup: C1[X(C13H25NO2)]
method: RPBEPBE
basis: SDD
operation: Freq
keyword: #p
keyword: freq=noraman
keyword: PBEPBE/SDD
title: #p freq=noraman PBEPBE/SDD
converged: YES YES NO NO
title: Mulliken charges:
elementType: O O N C C C C C C C C C C C C C H H H H H H H H H H H H H H H H H H H H H H H H H
charge: -0.413370 -0.238139 -0.313506 0.032072 -0.454035 -0.449470 -0.448763 -0.404622 -0.402823 -0.382810 -0.372232 -0.420894 -0.163701 0.155420 -0.331355 -0.685860 0.192031 0.210966 0.185670 0.189373 0.196932 0.196489 0.195053 0.189551 0.196065 0.195354 0.191879 0.187104 0.198047 0.205072 0.208005 0.212845 0.216129 0.242000 0.269820 0.184134 0.208012 0.209395 0.206095 0.233466 0.374601
chargesum: 0.00000
title: Mulliken charges with hydrogens summed into heavy atoms:
elementType: O O N C C C C C C C C C C C C C
charge: -0.038769 -0.238139 -0.043687 0.224103 -0.057400 -0.063165 -0.057221 -0.019006 -0.015590 0.002341 0.040846 0.008080 0.078299 0.155420 0.060790 -0.036903
polarizability: 1.79704692e+02 -7.68504837e+00 1.44262308e+02 3.32988033e+00 -1.95174970e+00 1.32982676e+02
1716.lowfreq: -18.9521 -4.9505 0.0007 0.0008 0.0009 4.0000 8.1220 24.9649 35.1906
frequency: -11.5653 24.8472 35.1743 45.7345 64.5879 76.4962 87.6322 107.2424 115.4411 162.8222 182.8060 204.4076 217.7426 246.3300 249.3009 306.5564 312.4910 327.9951 358.3994 402.3022 431.6054 448.1488 451.5418 533.0551 560.0218 588.2127 600.3406 640.4291 719.0823 732.2699 772.4573 783.4632 790.2068 808.8167 839.7297 848.0277 888.5049 895.9604 908.7567 919.1287 955.5457 992.6702 1015.8417 1028.2107 1041.0585 1050.2160 1053.7909 1059.3250 1066.3279 1084.0812 1097.0772 1106.4978 1110.8134 1115.9082 1156.7954 1158.7408 1173.5307 1187.1727 1230.7261 1236.4125 1249.6185 1252.3738 1257.1717 1262.5413 1275.0339 1285.0447 1295.1677 1309.2174 1313.8567 1324.0543 1333.2541 1337.8140 1339.0725 1339.4359 1350.7377 1358.1883 1360.3460 1375.6956 1390.6884 1451.6956 1453.1766 1455.5131 1460.2966 1461.1773 1461.5890 1468.8611 1471.5880 1474.6691 1478.9175 1480.9174 1497.2998 1661.3252 2870.4385 2928.3663 2942.9069 2948.9450 2956.2175 2962.1187 2962.8565 2963.8426 2965.8593 2975.4050 2980.6558 2991.5095 2995.9466 3012.5248 3017.3145 3023.3000 3024.2274 3027.2171 3028.1512 3038.4823 3049.5615 3072.9233 3095.3684 3450.6790 3491.0050
redmass: 3.1872 4.8051 3.8781 3.4541 2.1738 3.1679 3.8009 1.9528 3.7967 2.3539 2.6491 3.3929 1.8743 1.3627 2.5150 3.5361 1.8986 3.3567 3.4844 2.6140 2.7353 2.2521 2.7448 2.3330 2.2775 1.3923 3.6680 1.2437 1.9775 1.7367 2.0381 1.6640 1.8882 1.1140 1.8201 2.1368 1.5470 1.7877 1.8444 1.6611 2.5562 2.8730 1.8651 3.5179 2.7599 1.7647 1.3973 1.7959 1.9591 1.6923 1.8338 1.9267 1.5598 2.5087 1.8634 3.2390 1.9604 1.5769 1.4218 1.3668 1.3410 1.2109 1.2808 1.2201 1.2919 1.1668 1.1672 1.2618 1.2322 1.3264 1.3763 1.5650 1.4525 1.5694 1.4419 1.4919 1.5158 1.5969 1.2433 1.1912 1.0911 1.0879 1.0881 1.0894 1.0853 1.0830 1.0706 1.0976 1.0961 1.0506 1.0861 8.0879 1.0709 1.0805 1.0594 1.0623 1.0638 1.0606 1.0618 1.0662 1.0594 1.0590 1.0372 1.0986 1.0871 1.0977 1.0949 1.0981 1.0965 1.0952 1.0968 1.1035 1.1025 1.0984 1.1004 1.0745 1.0636
irintensity: 0.0572 2.1545 0.3928 0.2583 0.6150 0.1790 0.3433 0.0182 1.9264 0.7267 1.0799 1.3734 0.1735 1.1157 0.0947 1.6412 0.1829 0.7263 4.0566 5.6934 0.1709 4.3450 1.9564 13.7361 15.1937 38.1421 11.9081 244.0292 24.9979 18.7018 0.7486 0.4110 5.2158 5.4685 5.2010 1.7174 13.0743 2.7739 0.9937 6.5286 4.0271 26.0769 31.6722 9.2303 58.0005 3.2403 27.2591 40.2203 59.0986 6.1360 1.4332 8.4190 6.0553 0.0524 13.3696 78.2784 3.1793 1.0335 2.1113 1.4131 11.4502 0.6302 4.9835 5.4392 3.7216 0.8511 1.4476 1.7474 1.5098 8.7054 0.5668 1.4214 1.6375 4.3657 4.2928 1.9427 1.2780 24.2901 23.9689 17.9259 2.1647 2.8220 3.3959 5.5410 7.1711 18.6522 12.0855 8.4799 8.3102 7.4269 6.9419 196.6738 95.2418 5.4522 8.4856 27.7847 66.5739 39.7673 32.3116 30.4920 9.0623 49.4128 32.5057 6.6377 29.5931 42.5282 54.4857 90.7786 38.7032 8.7600 0.5606 141.5409 89.5384 53.4829 35.2643 2.4411 14.3951
temp: 298.150 k
press: 1.00000 atm
elementType: 8 8 7 6 6 6 6 6 6 6 6 6 6 6 6 6 1 1 1 1 1 1 1 1 1 1 1 1 1 1 1 1 1 1 1 1 1 1 1 1 1
symmnumber: 1
zpe: 955044.5 jmol-1
zpe.correction: 0.363757 hartree
zpe.thermalcorrener: 0.381433 hartree
zpe.thermalcorrenthalpy: 0.382378 hartree
zpe.thermalcorrgfe: 0.316413 hartree
zpe.sumelectzpe: -714.275897 hartree
zpe.sumelectthermal: -714.258220 hartree
zpe.sumelectthermalent: -714.257276 hartree
zpe.sumelectthermalfe: -714.323241 hartree
dipole: -1.3020 -1.0507 -0.7777
dipole: 1.8450
quadrupole: -106.5620 -93.8840 -103.9052
quadrupole: -6.5014 -2.8958 -1.4557
quadrupole: -5.1115 7.5664 -2.4548 -6.5014 -2.8958 -1.4557
hfenergy: -714.6396538 hartree
pointgroup: C01 [X(C13H25N1O2)]
dipole: 0.4972313 0.2225381 -0.4797473 debye
polarizability: 179.5988606|-8.6650161|143.5458724|-1.0013346|-3.209002|133.8049428 unknown
InChI: InChI=1S/C13H25NO2/c1-2-14-12(13(15)16)10-6-9-11-7-4-3-5-8-11/h11-12,14-15H,2-10H2,1H3
charge 0 multiplicity 1
41 atoms
O  -2.162596 -2.707517 0.769622
O  -2.959298 -1.203509 2.346999
N  -3.933878 0.208397 0.023511
C  2.573828 0.230444 0.225187
C  2.897534 -0.717943 -0.959957
C  3.656048 1.337137 0.330854
C  1.160021 0.856877 0.11987
C  4.327845 -1.301969 -0.864606
C  5.087059 0.757669 0.430226
C  5.392523 -0.185849 -0.757686
C  -0.006117 -0.158431 0.138095
C  -1.385578 0.535289 0.19718
C  -2.603443 -0.433837 0.026248
C  -2.611955 -1.444906 1.169056
C  -4.245467 1.105818 -1.105092
C  -5.721135 1.540217 -1.05268
H  2.613418 -0.37261 1.160787
H  2.162718 -1.54476 -1.004361
H  2.796445 -0.14731 -1.908599
H  3.589431 1.988198 -0.567378
H  3.444568 1.982541 1.207148
H  1.101828 1.462688 -0.810044
H  1.025625 1.568736 0.96212
H  4.394561 -1.953542 0.031832
H  4.533874 -1.945516 -1.74231
H  5.828614 1.579556 0.469542
H  5.18675 0.190568 1.379315
H  5.399367 0.403537 -1.698449
H  6.402457 -0.627185 -0.648348
H  0.113354 -0.834525 1.009351
H  0.037104 -0.802993 -0.762357
H  -1.499374 1.076318 1.158396
H  -1.446553 1.29037 -0.611568
H  -2.481112 -0.98977 -0.921658
H  -4.170351 0.602732 0.944034
H  -3.598867 2.016989 -1.143698
H  -4.057815 0.546541 -2.043551
H  -5.968114 2.195017 -1.907962
H  -5.936756 2.10282 -0.124187
H  -6.381578 0.656335 -1.077052
H  -2.177185 -3.324423 1.552871
