program: Gaussian 09
title: 000224409
version: EM64L-G09RevD.01
frameworkgroup: C1[X(C12H23NO2)]
method: RPBEPBE
basis: SDD
operation: Freq
keyword: #p
keyword: freq=noraman
keyword: PBEPBE/SDD
title: #p freq=noraman PBEPBE/SDD
converged: NO YES NO NO
title: Mulliken charges:
elementType: O O N C C C C C C C C C C C C H H H H H H H H H H H H H H H H H H H H H H H
charge: -0.413325 -0.241209 -0.624593 0.035698 -0.451376 -0.450072 -0.446362 -0.403808 -0.402549 -0.382551 -0.384844 -0.378719 -0.427373 -0.152902 0.151999 0.187958 0.185854 0.206184 0.196631 0.190092 0.196640 0.191872 0.195446 0.189414 0.191196 0.195469 0.197861 0.187112 0.202220 0.190700 0.211301 0.199423 0.227013 0.211676 0.255955 0.271773 0.311227 0.378973
chargesum: 0.00000
title: Mulliken charges with hydrogens summed into heavy atoms:
elementType: O O N C C C C C C C C C C C C
charge: -0.034353 -0.241209 -0.041593 0.223656 -0.059338 -0.063349 -0.057851 -0.018947 -0.015884 0.002422 0.008075 0.032004 0.011316 0.103053 0.151999
polarizability: 1.62391601e+02 -3.68714677e+00 1.31256218e+02 3.85003887e-01 -1.83575669e+00 1.24646247e+02
1716.lowfreq: -4.6293 -3.7557 -0.0004 -0.0002 0.0006 12.6543 22.0891 36.2462 46.1091
frequency: 21.2127 35.5988 46.0584 55.3241 78.1213 90.8728 104.1537 148.6145 161.9110 214.4809 217.6870 224.7828 261.9013 282.3187 314.5784 323.8034 376.4062 409.4157 431.7573 443.9742 457.3909 476.0890 522.3718 550.8057 576.6524 633.1336 717.8636 725.8547 759.0629 779.7668 783.1479 806.0586 842.0720 855.1446 889.3535 895.2804 910.0737 928.4980 959.5261 1017.5644 1029.1759 1038.5087 1049.8659 1053.2800 1058.3799 1071.0858 1075.7662 1088.4685 1105.1172 1118.7569 1153.9437 1162.6035 1179.2326 1195.6842 1213.5940 1237.3551 1248.6579 1256.4577 1261.0733 1265.9182 1270.5907 1287.4615 1290.0054 1298.2502 1312.3093 1322.0940 1333.2595 1339.2465 1339.5917 1340.1143 1355.4463 1360.0544 1361.3130 1388.0336 1454.3592 1458.2241 1460.8959 1463.1051 1464.2652 1466.5009 1468.6552 1475.6766 1483.1536 1605.1526 1668.8782 2928.1855 2945.3367 2949.7455 2954.8424 2956.8572 2961.6857 2962.4526 2962.6745 2964.0746 2968.9998 2982.0990 2989.2434 3004.7124 3013.5064 3022.1251 3023.5996 3025.3836 3029.0874 3038.0400 3048.1034 3495.5408 3519.1813 3637.7106
redmass: 3.3883 4.5629 5.3707 4.7929 4.1754 1.9291 2.9231 2.8759 2.3646 1.4864 1.7759 2.1338 2.9648 4.0311 1.7471 2.5818 2.4575 2.5579 2.8113 2.0445 2.7804 1.6343 2.4682 1.9156 2.5398 1.7164 3.4804 1.1905 1.5648 1.7602 1.5849 2.9847 1.9159 1.8177 1.6095 1.8699 1.8463 1.9155 2.3427 1.4948 3.0832 3.2886 2.3950 1.8377 1.1570 1.4533 2.2613 1.4506 2.2721 2.6086 1.4837 1.5300 1.7135 2.2209 1.3974 1.3865 1.2740 1.2610 1.4034 1.2828 1.4360 1.1185 1.1883 1.1919 1.2674 1.2993 1.3799 1.5134 1.4355 1.5926 1.4980 1.5327 1.5086 1.8573 1.0854 1.0921 1.0906 1.0841 1.0804 1.0884 1.0838 1.0959 1.0997 1.2847 4.0069 1.0802 1.0593 1.0616 1.0603 1.0620 1.0617 1.0612 1.0613 1.0663 1.0687 1.0743 1.0966 1.1000 1.0972 1.0991 1.0953 1.1007 1.1021 1.1036 1.1030 1.0450 1.0640 1.0999
irintensity: 0.0971 0.2026 0.8100 0.3541 0.1833 0.4590 0.1267 1.0041 0.0563 30.6678 0.0555 18.2647 5.1563 1.6495 0.0461 4.4940 11.5349 62.7323 1.5546 8.7386 41.1502 245.9575 8.2807 0.9617 69.7623 151.6237 20.8829 13.6971 0.8240 0.8464 0.1925 1.2092 5.5288 0.9990 10.1918 6.0822 0.2080 3.4152 7.7409 0.1447 7.9915 4.2524 216.5627 48.6025 1.0332 0.5782 16.2337 2.3057 0.2606 0.1293 7.5715 6.2387 5.3859 2.1256 5.0149 1.7416 3.5979 1.7039 2.9989 1.9428 9.8973 2.0551 1.0059 2.8819 0.1705 2.7628 0.1944 0.8245 0.1575 1.2277 0.3250 1.1417 1.1104 11.6271 0.6031 4.0114 4.7827 4.7358 6.0144 5.3120 14.4973 2.8027 14.1189 134.9693 139.4442 6.6484 1.5432 26.0852 5.2100 74.6021 46.3604 36.8360 11.6038 34.8941 40.1073 67.0028 2.0737 2.0526 75.6482 71.7130 52.1125 9.3667 33.6744 142.8866 108.4108 10.2816 27.0600 12.7122
temp: 298.150 k
press: 1.00000 atm
elementType: 8 8 7 6 6 6 6 6 6 6 6 6 6 6 6 1 1 1 1 1 1 1 1 1 1 1 1 1 1 1 1 1 1 1 1 1 1 1
symmnumber: 1
zpe: 883091.9 jmol-1
zpe.correction: 0.336352 hartree
zpe.thermalcorrener: 0.353438 hartree
zpe.thermalcorrenthalpy: 0.354382 hartree
zpe.thermalcorrgfe: 0.289702 hartree
zpe.sumelectzpe: -675.059115 hartree
zpe.sumelectthermal: -675.042030 hartree
zpe.sumelectthermalent: -675.041085 hartree
zpe.sumelectthermalfe: -675.105766 hartree
dipole: 1.7479 -0.4309 1.2010
dipole: 2.1641
quadrupole: -106.9680 -90.1444 -93.9405
quadrupole: -1.5020 -7.8734 5.2544
quadrupole: -9.9504 6.8733 3.0771 -1.5020 -7.8734 5.2544
hfenergy: -675.3954672 hartree
pointgroup: C01 [X(C12H23N1O2)]
dipole: 0.6883462 -0.1680787 0.4720392 debye
polarizability: 162.3803575|-3.7421091|131.2483382|0.3257844|-1.8654709|124.6653712 unknown
InChI: InChI=1S/C12H23NO2/c13-11(12(14)15)9-5-4-8-10-6-2-1-3-7-10/h10-11,14H,1-9,13H2
charge 0 multiplicity 1
38 atoms
O  -4.565297 1.018299 1.442305
O  -4.490001 1.356875 -0.853217
N  -4.058132 -1.344097 -1.290359
C  2.567669 0.310719 0.1613
C  3.141328 -1.127357 0.055627
C  3.506465 1.31048 -0.565225
C  1.122195 0.419555 -0.387633
C  4.599804 -1.214019 0.567232
C  4.963959 1.230946 -0.0532
C  5.519068 -0.208627 -0.165578
C  0.064885 -0.398901 0.388995
C  -1.373538 -0.147352 -0.117116
C  -2.428187 -0.968082 0.653765
C  -3.888624 -0.859682 0.079651
C  -4.344599 0.593666 0.127132
H  2.547688 0.588917 1.23983
H  3.106902 -1.444879 -1.009074
H  2.506506 -1.836858 0.620998
H  3.116616 2.341521 -0.446406
H  3.490269 1.088178 -1.654001
H  1.115877 0.108058 -1.454151
H  0.819361 1.488246 -0.376433
H  4.984133 -2.245662 0.444276
H  4.617149 -0.994349 1.655421
H  4.996403 1.551006 1.009301
H  5.605474 1.935098 -0.61858
H  6.54697 -0.258258 0.243866
H  5.585154 -0.490347 -1.23737
H  0.290159 -1.481888 0.310941
H  0.125911 -0.144233 1.468297
H  -1.603521 0.934738 -0.033388
H  -1.432133 -0.393948 -1.197206
H  -2.445678 -0.665623 1.718831
H  -2.154531 -2.043057 0.628655
H  -4.545484 -1.420953 0.774873
H  -3.576091 -2.213746 -1.517905
H  -4.025663 -0.621035 -2.012661
H  -4.835369 1.976354 1.43531
