program: Gaussian 09
title: 000224414
version: EM64L-G09RevD.01
frameworkgroup: C1[X(C14H14ClNO4)]
method: RPBEPBE
basis: SDD
operation: Freq
keyword: #p
keyword: freq=noraman
keyword: PBEPBE/SDD
title: #p freq=noraman PBEPBE/SDD
converged: YES YES NO NO
title: Mulliken charges:
elementType: Cl O O O O N C C C C C C C C C C C C C C H H H H H H H H H H H H H H
charge: 0.042078 -0.281244 -0.271070 -0.280362 -0.216878 -0.009025 0.385063 -0.193215 0.197655 -0.375778 0.269072 0.355454 -0.340871 -0.354815 -0.493457 0.157771 -0.217416 -0.518888 -0.488718 -0.671917 0.250912 0.259898 0.279497 0.232460 0.230553 0.238996 0.227966 0.216886 0.241283 0.219177 0.234474 0.213835 0.226976 0.233649
chargesum: 0.00000
title: Mulliken charges with hydrogens summed into heavy atoms:
elementType: Cl O O O O N C C C C C C C C C C C C C C
charge: 0.042078 -0.281244 -0.271070 -0.280362 -0.216878 -0.009025 0.385063 -0.193215 0.197655 -0.375778 0.269072 0.355454 -0.089959 -0.094918 -0.213959 0.157771 0.245597 0.164960 0.206215 0.002543
polarizability: 2.76822558e+02 7.39542042e-01 2.33645542e+02 -8.35452844e+00 1.78697528e+00 9.52095863e+01
1716.lowfreq: -21.3605 -6.3526 -5.1127 -0.0016 -0.0005 0.0012 5.2287 24.3276 27.8168
frequency: -21.3073 23.9662 27.6624 47.4571 63.4159 83.4116 92.6599 96.2320 130.0476 145.6270 176.5786 187.6179 208.5146 220.3134 241.8718 243.2149 256.1628 261.5554 273.1080 305.5561 338.5792 362.7513 378.8303 404.7170 432.7700 468.0378 497.9006 530.7874 541.5238 598.6722 607.3366 654.7657 656.1963 695.9695 730.9375 763.5923 768.4214 798.2190 802.2838 815.5704 840.5962 885.4334 920.8239 933.6659 950.3907 966.9418 1020.6250 1034.6124 1065.4778 1105.6573 1108.4813 1109.1041 1114.0851 1135.2440 1145.2880 1149.3238 1174.0817 1214.0225 1228.0873 1244.5316 1248.5362 1298.5889 1314.3652 1336.4894 1356.0515 1393.9861 1400.7279 1422.2570 1439.0682 1446.4813 1449.0278 1454.0734 1460.8197 1463.3611 1465.4815 1467.1222 1473.6490 1486.4521 1560.8278 1573.5592 1581.6462 1627.4302 2959.0121 2996.1614 3004.5932 3010.3706 3050.6290 3068.8056 3092.9927 3107.5569 3118.4971 3121.9801 3124.6352 3152.8154 3160.3936 3177.0660
redmass: 3.3473 4.3071 4.5047 5.1769 3.0390 3.7753 3.7440 3.9669 3.0731 1.0636 4.1097 3.3633 5.8742 1.2496 6.9829 1.5997 4.2286 5.9528 3.8517 6.2810 6.5169 6.7444 4.5005 4.8198 5.5619 6.2791 4.9596 6.1520 7.5566 4.9939 8.2716 5.7917 5.6550 6.5029 6.7578 9.2346 8.3537 1.1486 6.4871 4.0342 1.4651 6.2220 7.2288 1.4665 1.4244 6.6087 2.5977 5.0521 3.3716 2.5944 1.2445 1.4948 2.4608 1.4657 1.3367 1.3721 1.9834 9.2269 2.1121 2.4887 1.1432 4.7085 4.1427 8.0236 1.4126 2.0828 1.2621 1.9175 1.2497 2.3820 1.0623 1.0490 1.1396 1.0402 2.3027 1.0578 1.0608 1.0690 8.4091 6.9227 7.2350 12.0654 1.0318 1.0358 1.0279 1.0582 1.1039 1.1064 1.0986 1.1026 1.1050 1.1006 1.1056 1.0886 1.0919 1.0962
irintensity: 4.3640 4.2167 0.8549 0.6193 1.3712 0.6756 6.3183 2.8677 1.2117 0.0692 1.8634 3.3175 1.3717 2.4094 3.0054 0.3264 1.6379 11.0864 3.3390 5.5942 13.2493 2.6126 4.0183 4.2891 3.8741 2.8104 5.7559 2.6495 6.2716 6.7560 5.3259 1.1945 7.3570 4.8393 13.8982 24.4846 40.2517 3.4972 2.2954 2.7882 39.9973 22.9236 33.3076 15.5106 8.7869 126.4028 54.5346 77.5693 24.6418 304.3294 0.7199 63.3695 119.5129 6.3444 0.4118 14.9757 46.7434 8.8232 170.6614 208.3865 4.2393 161.7059 60.4904 18.0141 1.8378 38.0778 24.1813 22.0374 12.1085 11.9091 19.6392 47.0870 34.9349 13.3451 190.7829 5.9606 6.9402 12.7133 113.1489 17.7955 27.9236 200.9677 72.1931 21.4880 64.3549 19.8987 33.2663 6.7207 31.5935 41.3314 33.9343 26.0366 32.7948 8.1136 2.5152 5.4580
temp: 298.150 k
press: 1.00000 atm
elementType: 17 8 8 8 8 7 6 6 6 6 6 6 6 6 6 6 6 6 6 6 1 1 1 1 1 1 1 1 1 1 1 1 1 1
symmnumber: 1
zpe: 664793.6 jmol-1
zpe.correction: 0.253207 hartree
zpe.thermalcorrener: 0.272598 hartree
zpe.thermalcorrenthalpy: 0.273542 hartree
zpe.thermalcorrgfe: 0.203686 hartree
zpe.sumelectzpe: -1356.089147 hartree
zpe.sumelectthermal: -1356.069755 hartree
zpe.sumelectthermalent: -1356.068811 hartree
zpe.sumelectthermalfe: -1356.138667 hartree
dipole: -0.3014 1.8895 1.0151
dipole: 2.1660
quadrupole: -100.9087 -117.2184 -125.7842
quadrupole: -12.3546 6.0182 -0.8585
quadrupole: 13.7284 -2.5813 -11.1471 -12.3546 6.0182 -0.8585
hfenergy: -1356.3423531 hartree
pointgroup: C01 [X(C14H14Cl1N1O4)]
dipole: 0.0273289 0.7519198 -0.4000613 debye
polarizability: 276.5284092|5.214289|234.2424115|-2.7961401|-3.0094824|94.9068656 unknown
InChI: InChI=1S/C14H14ClNO4/c1-4-20-14(17)8-7-16-13-10(19-3)6-5-9(18-2)11(13)12(8)15/h5-7H,4H2,1-3H3
charge 0 multiplicity 1
34 atoms
Cl 0.917119 -2.812703 0.257845
O  -1.93375 -3.123428 0.478133
O  -3.311503 2.324414 -0.155288
O  3.475761 0.746633 0.261905
O  3.330343 -1.329205 -0.785786
N  -0.45993 1.605974 -0.197765
C  -1.082241 -0.805161 0.076998
C  -1.425675 0.621992 -0.060519
C  -2.157842 -1.748642 0.251966
C  0.329114 -1.111767 0.03555
C  -2.812051 1.032839 -0.037282
C  1.292933 -0.103435 -0.128554
C  -3.486297 -1.299661 0.281151
C  -3.815992 0.062955 0.135545
C  0.825832 1.253718 -0.227013
C  2.765077 -0.344161 -0.259527
C  4.964886 0.663627 0.14379
C  -2.114835 -3.993178 -0.700277
C  -2.497703 3.529595 -0.401084
C  5.52675 1.931455 0.777828
H  -4.275875 -2.040473 0.443437
H  -4.855851 0.400005 0.163638
H  1.565602 2.052353 -0.32994
H  5.299864 -0.254818 0.658491
H  5.223466 0.570237 -0.926767
H  -2.003269 -5.022289 -0.327412
H  -1.340863 -3.786204 -1.463901
H  -3.1219 -3.857115 -1.141413
H  -1.797821 3.714815 0.427856
H  -3.249381 4.332187 -0.47473
H  -1.923013 3.439945 -1.336548
H  6.630469 1.91824 0.721737
H  5.164036 2.831654 0.252561
H  5.233641 2.004801 1.838876
