program: Gaussian 09
title: 000224408
version: EM64L-G09RevD.01
frameworkgroup: C1[X(C12H23NO2)]
method: RPBEPBE
basis: SDD
operation: Freq
keyword: #p
keyword: freq=noraman
keyword: PBEPBE/SDD
title: #p freq=noraman PBEPBE/SDD
converged: YES YES NO NO
title: Mulliken charges:
elementType: O O N C C C C C C C C C C C C H H H H H H H H H H H H H H H H H H H H H H H
charge: -0.414524 -0.237388 -0.331654 0.044483 -0.452694 -0.450634 -0.451168 -0.403413 -0.401745 -0.382967 -0.426537 -0.185121 0.135667 -0.326363 -0.690447 0.186006 0.186720 0.205739 0.199517 0.189720 0.197123 0.223043 0.196323 0.190027 0.191783 0.196365 0.198503 0.187330 0.224348 0.231125 0.261013 0.289281 0.182914 0.210772 0.233381 0.205695 0.209538 0.378239
chargesum: 0.00000
title: Mulliken charges with hydrogens summed into heavy atoms:
elementType: O O N C C C C C C C C C C C C
charge: -0.036285 -0.237388 -0.042373 0.230489 -0.060235 -0.061396 -0.031002 -0.017063 -0.013597 0.002865 0.028936 0.075893 0.135667 0.067323 -0.041833
polarizability: 1.51186099e+02 1.60917176e+00 1.40332424e+02 -1.82717064e+00 -4.15425949e-01 1.27407477e+02
1716.lowfreq: -14.6124 -0.0011 -0.0010 -0.0010 6.1713 9.5114 16.3817 31.5206 49.5333
frequency: 2.1041 31.2254 49.5237 68.8678 83.1106 101.8899 114.8339 131.1299 160.7544 190.3619 214.3496 237.8633 264.6866 306.0511 317.6278 340.6751 349.7415 380.1485 424.3092 433.0383 453.0784 521.2440 552.6118 571.1676 584.0528 639.1640 722.9518 755.9491 774.0486 782.8293 809.5417 827.7987 841.8517 862.7902 887.1476 889.9995 912.0506 937.8721 961.3895 994.5633 1030.7818 1048.5804 1054.2127 1055.5558 1062.0396 1077.7441 1092.3887 1113.8476 1116.4973 1129.1007 1165.1939 1170.2311 1174.2888 1199.8153 1228.6272 1243.5155 1248.7423 1256.8786 1260.9810 1266.8202 1282.9632 1292.6023 1311.8609 1315.4446 1329.9940 1332.7428 1339.0615 1340.5253 1342.3543 1358.7642 1370.6280 1374.3750 1389.3291 1451.7490 1455.5483 1459.2712 1459.6841 1462.2157 1466.6298 1471.3092 1472.5538 1476.5636 1481.6728 1502.4051 1659.1109 2855.7241 2928.1314 2948.8504 2952.2706 2959.6560 2962.7816 2963.0119 2963.8704 2979.4901 2982.7901 2986.4023 2996.8359 3005.5752 3014.6493 3022.0510 3024.5581 3026.0106 3038.3879 3049.9607 3071.5577 3094.3695 3471.7517 3510.1840
redmass: 3.0094 3.6857 7.5484 3.0351 3.4133 2.2154 3.0696 3.5993 2.6022 2.4692 1.7493 1.4344 2.0303 2.5723 2.1747 3.6382 3.9817 3.3497 1.9356 3.0084 2.4742 2.0438 1.5492 1.6833 2.3482 1.8388 3.3941 1.5781 1.6203 2.1535 1.1601 2.6100 1.7903 2.4688 1.8963 1.4847 2.0132 1.8206 2.4603 1.7832 2.8409 2.2955 1.1359 2.1864 2.0448 1.4542 2.4098 2.1491 2.0655 1.7327 1.8006 1.5865 2.3229 1.7037 1.4219 1.3414 1.2999 1.2767 1.3380 1.2507 1.2122 1.2339 1.2779 1.2797 1.4700 1.3866 1.5935 1.5249 1.4934 1.5084 1.4059 1.5628 1.2451 1.1173 1.1349 1.0907 1.0919 1.0917 1.0820 1.0894 1.1021 1.0973 1.0611 1.0877 8.4580 1.0717 1.0808 1.0627 1.0611 1.0607 1.0608 1.0606 1.0677 1.0398 1.0692 1.0831 1.0749 1.0998 1.0966 1.0991 1.0942 1.1018 1.1037 1.1028 1.0982 1.1003 1.0750 1.0639
irintensity: 0.0802 0.0182 1.0234 0.0110 0.5165 0.6731 2.3072 1.5342 0.8864 1.3405 0.1288 0.9503 0.4640 0.4815 0.1200 3.8744 7.4608 2.4522 0.6587 0.8205 11.0632 27.5797 18.6055 101.3544 89.8489 98.2252 30.2030 8.8358 1.4478 0.9880 4.8100 1.7173 5.3226 1.8463 11.9030 10.3242 0.1254 8.8481 5.4255 1.1993 147.1848 3.4257 0.5750 12.8701 114.8695 3.9239 1.0292 6.7715 6.0482 2.2878 22.0975 38.0742 11.5242 7.8117 3.5089 2.5546 6.0911 1.3982 3.8812 11.3712 1.1033 5.0427 7.8819 0.7841 8.2308 0.2741 1.6831 0.8631 9.1692 1.7685 1.1994 26.7017 23.9420 7.6680 9.0437 4.5872 9.3406 4.4748 14.0967 20.8361 14.9393 5.3892 7.4011 1.5088 194.1808 111.5712 6.6972 23.6250 11.3115 80.3859 29.9639 28.8340 28.2070 27.7499 15.9407 33.9561 36.9748 2.4891 92.9918 66.9798 43.1940 14.2582 135.3718 57.9427 53.2570 35.1795 6.9027 22.5316
temp: 298.150 k
press: 1.00000 atm
elementType: 8 8 7 6 6 6 6 6 6 6 6 6 6 6 6 1 1 1 1 1 1 1 1 1 1 1 1 1 1 1 1 1 1 1 1 1 1 1
symmnumber: 1
zpe: 882176.9 jmol-1
zpe.correction: 0.336003 hartree
zpe.thermalcorrener: 0.353008 hartree
zpe.thermalcorrenthalpy: 0.353952 hartree
zpe.thermalcorrgfe: 0.287579 hartree
zpe.sumelectzpe: -675.053476 hartree
zpe.sumelectthermal: -675.036472 hartree
zpe.sumelectthermalent: -675.035528 hartree
zpe.sumelectthermalfe: -675.101900 hartree
dipole: 1.5513 0.1884 -1.1837
dipole: 1.9604
quadrupole: -100.7856 -85.5844 -97.1116
quadrupole: 0.2401 3.9123 1.8580
quadrupole: -6.2917 8.9094 -2.6177 0.2401 3.9123 1.8580
hfenergy: -675.3894795 hartree
pointgroup: C01 [X(C12H23N1O2)]
dipole: 0.5734126 0.1190702 -0.5018868 debye
polarizability: 150.4805955|2.5448446|140.7096294|-3.1132418|-1.2077616|127.7357747 unknown
InChI: InChI=1S/C12H23NO2/c1-2-13-11(12(14)15)9-8-10-6-4-3-5-7-10/h10-11,13-14H,2-9H2,1H3
charge 0 multiplicity 1
38 atoms
O  -2.540004 -3.005561 -0.619037
O  -2.587224 -2.064098 1.501829
N  -2.807426 0.482326 0.360871
C  1.697183 -0.334303 -0.124711
C  2.064585 0.866564 -1.036992
C  2.591175 -0.33298 1.143628
C  0.198861 -0.35079 0.275448
C  3.574163 0.896773 -1.379845
C  4.100147 -0.305166 0.805205
C  4.446526 0.898516 -0.102918
C  -0.777791 -0.496443 -0.910658
C  -2.291513 -0.604316 -0.480875
C  -2.500146 -1.917468 0.26238
C  -2.652655 1.85861 -0.133554
C  -3.388289 2.846074 0.789877
H  1.914065 -1.268006 -0.691963
H  1.787872 1.807749 -0.514016
H  1.473515 0.835224 -1.972839
H  2.35554 -1.2196 1.765866
H  2.338838 0.560087 1.754806
H  -0.031807 0.582699 0.830984
H  0.036622 -1.182305 0.991889
H  3.803715 1.783517 -2.002647
H  3.826394 0.003891 -1.98937
H  4.37697 -1.24571 0.284534
H  4.697881 -0.268527 1.736955
H  5.520797 0.881553 -0.371807
H  4.269879 1.840102 0.457925
H  -0.522894 -1.390011 -1.513806
H  -0.69557 0.377256 -1.584463
H  -2.885783 -0.655168 -1.414818
H  -2.586633 0.354106 1.356147
H  -1.584841 2.178819 -0.232441
H  -3.089185 1.910525 -1.151789
H  -4.459921 2.588911 0.850563
H  -2.971227 2.815742 1.814911
H  -3.289931 3.881572 0.416856
H  -2.636786 -3.846766 -0.094823
