program: Gaussian 09
title: 000224405
version: EM64L-G09RevD.01
frameworkgroup: C1[X(C11H21NO2)]
method: RPBEPBE
basis: SDD
operation: Freq
keyword: #p
keyword: freq=noraman
keyword: PBEPBE/SDD
title: #p freq=noraman PBEPBE/SDD
converged: NO YES NO NO
title: Mulliken charges:
elementType: O O N C C C C C C C C C C C H H H H H H H H H H H H H H H H H H H H H
charge: -0.416066 -0.235867 -0.320011 0.049287 -0.457205 -0.450013 -0.489317 -0.407662 -0.403243 -0.383098 -0.155993 0.147901 -0.332411 -0.686094 0.210471 0.188346 0.220660 0.200759 0.189379 0.217830 0.208597 0.197347 0.192861 0.193053 0.196875 0.199198 0.187077 0.253893 0.267412 0.184318 0.208054 0.233341 0.206019 0.209143 0.375162
chargesum: 0.00000
title: Mulliken charges with hydrogens summed into heavy atoms:
elementType: O O N C C C C C C C C C C C
charge: -0.040904 -0.235867 -0.052599 0.259758 -0.048198 -0.059875 -0.062891 -0.017455 -0.013315 0.003176 0.097900 0.147901 0.059961 -0.037591
polarizability: 1.48932638e+02 -5.43702420e+00 1.23520997e+02 4.37367626e+00 -2.12712411e-01 1.16439291e+02
1716.lowfreq: -25.2492 -2.9784 0.0005 0.0007 0.0008 5.8163 22.3235 34.4627 48.4512
frequency: 12.9430 34.2450 48.2954 63.7412 76.6099 103.1830 124.6382 148.7472 217.2058 237.4370 241.8970 259.7105 300.5603 310.2211 317.6868 380.6479 423.2574 431.3557 438.7930 502.0688 575.4073 596.9565 599.7446 641.8518 723.8063 768.8252 783.5863 792.6365 810.9154 841.7788 860.4766 888.8060 908.5407 911.7946 960.2291 965.5419 1003.9173 1032.3709 1049.4124 1053.7591 1061.6828 1076.2489 1091.5302 1106.2357 1112.4371 1122.3930 1151.1402 1157.8937 1184.9017 1198.1632 1240.0741 1247.8778 1257.0136 1261.3275 1269.4998 1280.2751 1304.2218 1314.8151 1323.8858 1334.4404 1337.5426 1341.1141 1343.5686 1353.2145 1363.1289 1379.7075 1390.5244 1451.0709 1453.5553 1459.5150 1461.3647 1463.5212 1467.7108 1473.5542 1475.4211 1481.4119 1497.5376 1661.9209 2873.3021 2939.5032 2949.6207 2956.5252 2963.0653 2964.5082 2965.1395 2966.0621 2981.2965 2995.8130 3014.4013 3022.1441 3025.0644 3027.0149 3033.0116 3041.1877 3051.0042 3073.2171 3095.0791 3450.2727 3492.2140
redmass: 3.1863 5.5445 3.5726 2.7146 2.2378 4.5325 2.9763 3.3936 1.7918 2.2999 1.8620 1.9099 3.1002 2.5903 2.4604 3.0652 2.2272 2.5555 3.3819 2.0477 2.0747 1.4989 3.6040 1.2542 4.0648 2.5354 1.5164 2.1118 1.1181 2.0941 2.0670 1.6806 1.7059 1.7865 2.3575 1.7002 4.1453 3.0556 1.9193 1.2817 1.7154 1.5726 2.4997 1.9202 2.3797 1.5659 1.7288 3.1538 1.7627 1.5075 1.5008 1.2381 1.2745 1.2134 1.3418 1.2196 1.2566 1.2721 1.3413 1.3498 1.5112 1.5458 1.4263 1.4074 1.4773 1.5470 1.2548 1.0901 1.1904 1.0875 1.0901 1.0894 1.0808 1.0740 1.0956 1.0587 1.0863 8.1255 1.0705 1.0791 1.0630 1.0651 1.0614 1.0626 1.0612 1.0635 1.0369 1.0876 1.0984 1.0972 1.0959 1.1006 1.0986 1.1024 1.0878 1.0986 1.1003 1.0744 1.0636
irintensity: 0.0581 2.4740 0.1585 0.0156 1.0575 0.5771 0.0634 2.4338 0.1639 0.0132 2.0267 0.5331 1.0874 0.5118 1.2545 5.7042 0.8414 0.9787 2.7686 12.9632 11.5703 26.3435 12.3371 263.7740 22.5235 5.1717 1.3044 6.5828 5.0934 7.1429 0.9386 6.0948 8.1604 5.0687 15.6539 4.6456 35.0449 57.6485 15.4534 25.3579 98.1504 6.8640 1.2669 11.6583 0.6659 1.8477 6.3233 86.0401 1.8249 1.0904 3.7571 1.2852 1.8096 2.3363 13.6128 1.6220 2.6063 4.8558 5.7113 0.4967 1.8950 0.8214 2.8196 6.1516 2.2345 17.7525 26.4673 4.9013 14.8727 2.8630 8.4326 8.2651 23.6641 15.0228 3.0591 4.5335 7.2667 198.6027 92.4203 4.5067 18.6581 27.7829 33.6796 33.7797 63.6659 27.5818 33.2412 28.1638 39.4752 51.8998 77.8746 24.6705 7.6992 141.2237 28.6609 52.3039 35.3743 2.2123 14.6236
temp: 298.150 k
press: 1.00000 atm
elementType: 8 8 7 6 6 6 6 6 6 6 6 6 6 6 1 1 1 1 1 1 1 1 1 1 1 1 1 1 1 1 1 1 1 1 1
symmnumber: 1
zpe: 809121.1 jmol-1
zpe.correction: 0.308178 hartree
zpe.thermalcorrener: 0.323947 hartree
zpe.thermalcorrenthalpy: 0.324891 hartree
zpe.thermalcorrgfe: 0.262835 hartree
zpe.sumelectzpe: -635.830138 hartree
zpe.sumelectthermal: -635.814369 hartree
zpe.sumelectthermalent: -635.813425 hartree
zpe.sumelectthermalfe: -635.875481 hartree
dipole: -1.2563 -1.2211 -0.5957
dipole: 1.8504
quadrupole: -89.8895 -82.0852 -90.2532
quadrupole: -6.3577 -1.1388 -3.0839
quadrupole: -2.4802 5.3241 -2.8439 -6.3577 -1.1388 -3.0839
hfenergy: -636.1383163 hartree
pointgroup: C01 [X(C11H21N1O2)]
dipole: -0.4909868 -0.2759189 -0.4613124 debye
polarizability: 148.0946466|-8.2314302|122.64893|2.3336074|2.5970595|118.1493504 unknown
InChI: InChI=1S/C11H21NO2/c1-2-12-10(11(13)14)8-9-6-4-3-5-7-9/h9-10,12-13H,2-8H2,1H3
charge 0 multiplicity 1
35 atoms
O  0.802052 2.650263 0.56979
O  1.719803 1.371145 2.274648
N  2.756195 -0.221105 0.106287
C  -1.205981 -0.107965 0.252742
C  -1.558871 0.440847 -1.155477
C  -2.223144 -1.202933 0.672742
C  0.236793 -0.66863 0.33141
C  -3.02318 0.936715 -1.233942
C  -3.685318 -0.704318 0.600131
C  -4.022774 -0.164743 -0.809911
C  1.393673 0.349572 0.048355
C  1.345033 1.467483 1.084674
C  3.116778 -1.201383 -0.93601
C  4.61387 -1.548767 -0.85105
H  -1.303741 0.732182 0.975418
H  -1.404531 -0.367787 -1.902233
H  -0.877529 1.269727 -1.425497
H  -1.99051 -1.554291 1.69805
H  -2.103553 -2.079477 0.000124
H  0.337631 -1.49555 -0.400546
H  0.409381 -1.10116 1.338721
H  -3.248823 1.285651 -2.260559
H  -3.143935 1.814364 -0.565277
H  -3.832635 0.105816 1.344398
H  -4.37971 -1.521857 0.876018
H  -5.058429 0.22683 -0.8340
H  -3.977503 -0.999763 -1.539996
H  1.252744 0.797762 -0.950538
H  3.004677 -0.520512 1.059075
H  2.520256 -2.145618 -0.887054
H  2.899024 -0.742092 -1.921013
H  5.225112 -0.636248 -0.959098
H  4.859822 -2.011724 0.123745
H  4.896271 -2.26443 -1.644415
H  0.780557 3.341594 1.287988
