program: Gaussian 09
title: 000224399
version: EM64L-G09RevD.01
frameworkgroup: C1[X(C10H19NO2)]
method: RPBEPBE
basis: SDD
operation: Freq
keyword: #p
keyword: freq=noraman
keyword: PBEPBE/SDD
title: #p freq=noraman PBEPBE/SDD
converged: NO YES NO NO
title: Mulliken charges:
elementType: O O N C C C C C C C C C C H H H H H H H H H H H H H H H H H H H
charge: -0.411637 -0.234075 -0.298040 -0.045310 -0.442901 -0.424272 -0.408367 -0.408738 -0.209017 -0.383439 0.121645 -0.327621 -0.690812 0.213409 0.200351 0.213841 0.239915 0.179898 0.198064 0.194210 0.193045 0.199005 0.253059 0.199077 0.188932 0.258714 0.212957 0.195453 0.208957 0.229491 0.212451 0.371751
chargesum: 0.00000
title: Mulliken charges with hydrogens summed into heavy atoms:
elementType: O O N C C C C C C C C C C
charge: -0.039886 -0.234075 -0.039325 0.168099 -0.028709 -0.004459 -0.016093 -0.016688 0.044042 0.004571 0.121645 0.080790 -0.039911
polarizability: 1.34909420e+02 -5.32247023e-01 1.22729224e+02 1.10676719e+00 -1.45812039e+00 1.01429677e+02
1716.lowfreq: -17.9165 -0.0009 -0.0002 0.0005 5.2601 10.2223 40.9774 52.3625 65.0150
frequency: 40.6802 52.2657 64.8701 77.8812 83.2247 115.3128 159.6770 215.0927 238.2710 254.6951 263.9978 281.5538 313.9733 337.3746 418.5709 428.2708 445.5079 494.6835 537.3531 609.1386 632.8795 682.7305 717.3420 786.5043 798.5326 808.9130 833.7722 856.8139 880.2816 896.7440 921.7191 928.3485 960.2657 1029.3169 1038.8342 1050.8766 1054.7038 1079.9407 1081.7971 1103.8599 1113.7404 1119.2979 1146.9404 1168.1394 1192.3934 1217.4759 1237.5729 1256.2437 1258.9571 1264.3599 1280.2406 1305.2417 1316.6373 1327.7182 1332.2597 1334.6791 1339.9156 1341.5793 1360.3514 1373.7008 1391.0117 1455.3445 1458.8379 1462.1767 1462.6582 1471.0039 1474.0302 1478.9889 1480.5666 1493.3881 1644.9427 2880.1282 2945.0674 2959.1907 2964.7209 2964.9184 2966.1531 2967.3245 2981.2217 3010.1857 3022.1718 3026.0688 3027.9074 3030.4261 3039.5170 3054.3682 3074.7260 3092.9494 3415.7133 3483.3334
redmass: 4.0970 4.9379 3.5716 2.0696 2.4561 5.0277 2.7957 1.8926 1.7718 3.3885 1.7614 3.5505 2.1710 3.3420 2.4986 2.6745 2.3948 2.6513 2.0571 2.8924 1.4241 1.5879 4.0796 1.4664 2.4519 1.1560 2.2748 3.1173 1.9613 1.4168 1.6345 2.0984 2.4598 2.6935 2.7587 1.7124 1.2699 1.4611 2.3534 2.0738 2.4619 1.7748 3.1449 1.9985 1.5699 1.4745 1.4374 1.2983 1.2297 1.2732 1.2770 1.2661 1.3117 1.4318 1.3968 1.4557 1.5357 1.4806 1.4706 1.3191 1.2518 1.1386 1.0906 1.0880 1.0880 1.0819 1.0668 1.0921 1.0652 1.0869 8.0483 1.0709 1.0793 1.0672 1.0601 1.0607 1.0661 1.0641 1.0365 1.0886 1.0969 1.0947 1.0947 1.0937 1.1020 1.0962 1.0987 1.1003 1.0735 1.0638
irintensity: 1.0357 0.9012 0.7665 1.3482 0.6360 0.1201 0.9351 0.1307 1.2431 3.4233 5.0844 0.2004 1.4162 4.8008 0.8581 0.2339 5.2174 8.0109 25.3723 16.2329 115.1009 126.8891 19.2158 0.1692 0.6157 7.2994 10.7884 6.4536 1.2096 8.8224 3.6750 1.6831 13.6518 224.7651 13.6003 0.4766 0.0211 1.8217 4.3104 5.9884 0.7866 27.3829 48.9201 10.4789 2.2159 1.2174 2.7798 2.5994 1.0225 8.8381 10.6478 3.4834 5.1749 11.5521 0.5460 2.4932 2.2386 0.6560 2.3117 3.8277 25.3561 27.1391 2.8627 5.2071 10.7797 13.1322 23.1279 3.6992 2.5256 4.5577 178.2552 92.5523 3.5628 21.0900 35.7161 30.8537 22.7522 57.4902 31.0445 20.6404 62.1463 69.9336 23.2823 9.3563 104.5417 45.0161 51.7811 36.4126 0.4055 11.2920
temp: 298.150 k
press: 1.00000 atm
elementType: 8 8 7 6 6 6 6 6 6 6 6 6 6 1 1 1 1 1 1 1 1 1 1 1 1 1 1 1 1 1 1 1
symmnumber: 1
zpe: 735960.9 jmol-1
zpe.correction: 0.280313 hartree
zpe.thermalcorrener: 0.294673 hartree
zpe.thermalcorrenthalpy: 0.295617 hartree
zpe.thermalcorrgfe: 0.238329 hartree
zpe.sumelectzpe: -596.610650 hartree
zpe.sumelectthermal: -596.596290 hartree
zpe.sumelectthermalent: -596.595346 hartree
zpe.sumelectthermalfe: -596.652634 hartree
dipole: -0.0661 0.1494 -0.9375
dipole: 0.9516
quadrupole: -77.0745 -77.8303 -83.4912
quadrupole: -0.5237 -2.5460 -3.5089
quadrupole: 2.3908 1.6350 -4.0259 -0.5237 -2.5460 -3.5089
hfenergy: -596.890963 hartree
pointgroup: C01 [X(C10H19N1O2)]
dipole: 0.0202925 0.0434413 0.3713053 debye
polarizability: 134.8261433|0.9383512|122.6158665|1.3967798|2.4446179|101.6263113 unknown
InChI: InChI=1S/C10H19NO2/c1-2-11-9(10(12)13)8-6-4-3-5-7-8/h8-9,11-12H,2-7H2,1H3
charge 0 multiplicity 1
32 atoms
O  -1.295278 2.392596 1.074769
O  -1.603483 1.911443 -1.175586
N  -1.620209 -0.913664 -0.226293
C  0.726665 -0.064134 -0.181966
C  1.662303 1.102725 0.227587
C  1.296218 -1.413838 0.323936
C  3.107064 0.870075 -0.276799
C  2.735762 -1.650731 -0.188791
C  -0.735139 0.128845 0.327944
C  3.672133 -0.485286 0.209724
C  -1.2410 1.537073 -0.036188
C  -2.987615 -0.972131 0.346489
C  -3.780332 -2.134814 -0.273851
H  0.68654 -0.091286 -1.294042
H  1.664338 1.196062 1.333636
H  1.284964 2.064077 -0.172629
H  0.621698 -2.233735 0.018751
H  1.304145 -1.40027 1.435161
H  3.759303 1.700447 0.056966
H  3.110104 0.8878 -1.38661
H  2.721004 -1.745905 -1.294696
H  3.123978 -2.609109 0.207782
H  -0.739354 0.048251 1.430806
H  4.687105 -0.646662 -0.2028
H  3.773177 -0.462455 1.314845
H  -1.650498 -0.847479 -1.255554
H  -2.889097 -1.126042 1.438541
H  -3.557314 -0.021511 0.202561
H  -3.905142 -1.993979 -1.364452
H  -3.253651 -3.090981 -0.108983
H  -4.78842 -2.203717 0.173151
H  -1.621573 3.289835 0.786291
