program: Gaussian 09
title: 000224397
version: EM64L-G09RevD.01
frameworkgroup: C1[X(C10H8ClNO)]
method: RPBEPBE
basis: SDD
operation: Freq
keyword: #p
keyword: freq=noraman
keyword: PBEPBE/SDD
title: #p freq=noraman PBEPBE/SDD
converged: NO YES NO NO
title: Mulliken charges:
elementType: Cl O N C C C C C C C C C C H H H H H H H H
charge: -0.059423 -0.428373 -0.010570 0.438765 -0.067844 0.523907 -0.320373 -0.355130 -0.526878 -0.492582 -0.288804 -0.235552 -0.221907 0.255043 0.255293 0.227457 0.220677 0.267340 0.234786 0.237220 0.346950
chargesum: 0.00000
title: Mulliken charges with hydrogens summed into heavy atoms:
elementType: Cl O N C C C C C C C C C C
charge: -0.059423 -0.081424 -0.010570 0.438765 -0.067844 0.523907 -0.320373 -0.100087 -0.271585 -0.044448 -0.021464 -0.000766 0.015313
polarizability: 1.89454202e+02 -8.48786830e+00 1.40514657e+02 -5.62011196e+00 2.38177963e+00 5.66841549e+01
1716.lowfreq: -7.0352 -0.0026 -0.0021 -0.0005 6.5721 10.1954 67.9646 81.1897 116.5992
frequency: 67.9584 81.1860 116.5983 190.6753 208.6745 219.4251 250.2989 343.7138 381.4964 396.6889 423.6346 465.8786 479.0054 527.4288 540.9507 571.1614 634.4295 659.3864 733.4458 776.7602 790.5439 792.3263 883.7699 896.2453 919.8201 929.2954 966.3872 972.2551 999.9452 1007.9289 1027.1412 1123.2551 1151.4377 1168.2255 1212.4135 1227.9265 1278.1105 1317.6901 1329.4225 1357.2701 1368.8422 1385.5854 1412.5364 1450.8726 1459.5318 1476.7815 1547.0232 1589.4267 1623.3843 2979.7113 3089.9575 3118.9158 3137.9960 3151.0743 3166.0614 3176.6850 3539.5657
redmass: 5.7748 4.5038 5.0234 5.9397 9.0003 4.7401 2.9347 6.5273 3.5509 1.4207 3.3383 4.3032 3.7633 7.4686 4.4855 4.9263 5.9537 4.3937 5.9372 1.3372 6.1177 3.4185 1.6475 3.2040 2.0075 2.8045 2.5048 1.3744 1.3299 3.5145 2.2909 1.8220 1.3672 1.1291 2.0947 2.2576 1.6487 1.3077 3.3032 2.5487 2.6589 1.2858 3.3582 2.0828 1.2426 3.3372 6.9977 7.6509 6.7761 1.0669 1.0967 1.0913 1.0859 1.0896 1.0957 1.1000 1.0660
irintensity: 2.3962 1.4186 0.9561 2.5560 1.7696 0.5490 10.7054 2.8769 67.1622 120.5550 7.6588 3.8122 12.8819 1.3285 2.6153 3.6343 12.3154 6.3878 24.9406 90.7138 14.6305 5.5135 0.4292 11.0958 33.3477 77.6070 2.4223 3.1484 0.0288 19.6127 23.7602 2.5613 45.5845 35.0280 4.0505 13.6583 3.3419 17.9948 4.9856 38.4087 8.3711 29.8607 12.3329 3.0220 5.2675 52.0709 21.3547 18.5932 5.4505 47.9958 15.2902 16.7854 3.1156 6.3364 11.0119 19.1019 5.7857
temp: 298.150 k
press: 1.00000 atm
elementType: 17 8 7 6 6 6 6 6 6 6 6 6 6 1 1 1 1 1 1 1 1
symmnumber: 1
zpe: 407293.5 jmol-1
zpe.correction: 0.155130 hartree
zpe.thermalcorrener: 0.165942 hartree
zpe.thermalcorrenthalpy: 0.166886 hartree
zpe.thermalcorrgfe: 0.118077 hartree
zpe.sumelectzpe: -974.977799 hartree
zpe.sumelectthermal: -974.966987 hartree
zpe.sumelectthermalent: -974.966043 hartree
zpe.sumelectthermalfe: -975.014852 hartree
dipole: -1.8164 1.7925 -1.1240
dipole: 2.7885
quadrupole: -77.1750 -80.9202 -86.1573
quadrupole: -2.2691 -6.0338 2.8910
quadrupole: 4.2425 0.4973 -4.7398 -2.2691 -6.0338 2.8910
hfenergy: -975.132929 hartree
pointgroup: C01 [X(C10H8Cl1N1O1)]
dipole: -0.7954435 -0.6334408 0.4118184 debye
dipolederiv: -0.282635 0.2207841 0.0127568 0.3105325 -0.7165491 -0.0059371 0.0360079 -0.0228257 -0.0799688 -0.8424544 0.1554344 -0.0000168 0.2860805 -0.2490522 -0.1062846 0.1940077 -0.0640877 -0.6242363 -0.4210093 0.065284 -0.007701 0.083372 -0.3489999 -0.003329 -0.0149053 -0.0035865 -0.2225613 -0.1809557 0.1355577 -0.0165328 0.3500798 -0.3670125 0.0019198 -0.0025211 -0.0165011 0.1042435 0.2719028 0.1848898 0.0280645 -0.1951234 0.1312968 -0.0110467 0.0022091 0.0197843 0.0443328 -0.2074626 -0.0072825 0.0030232 -0.1248239 -0.5461001 -0.0472738 -0.0892669 -0.0557459 -0.0220538 0.4313743 -0.2525442 0.0296582 -0.4479098 1.0785973 0.0249924 -0.0216632 0.0521817 -0.0788149 -0.0607504 -0.0690421 0.0049347 0.0165614 0.0496987 0.0119402 0.0092692 0.0052128 -0.1523886 0.1767569 -0.163104 0.0065623 0.094427 0.4711599 0.0392853 0.0344076 0.0066453 -0.067162 0.7015841 0.0173329 -0.0439802 -0.0788239 0.308756 0.0943523 -0.0924848 0.0621719 0.5138628 -0.0818821 -0.0849543 -0.001561 -0.0744222 0.0814354 0.0072432 0.0016951 0.0034824 -0.1370983 -0.0381165 0.1232361 0.0144459 0.1273553 0.1127589 0.02132 0.0148283 0.0225047 -0.1374327 0.1172275 -0.0966654 0.0169628 -0.1230532 -0.0340925 -0.0023461 0.012845 -0.0006618 -0.1462025 0.0839852 0.0663553 -0.0031477 0.0020354 -0.0246492 -0.0109745 -0.0037832 -0.0056089 0.1613732 -0.0368861 -0.0897328 -0.017448 -0.074408 -0.0052072 -0.0126966 -0.016544 -0.0118556 0.1214149 0.0438728 -0.0321224 -0.0001884 -0.1079113 -0.0735521 -0.0834896 0.0140263 -0.0288286 0.0621619 -0.0361858 0.0086207 0.0076274 0.1004778 -0.001501 0.1322318 0.0080168 0.0520742 -0.1101988 0.0781149 0.0177795 -0.0046333 0.067357 -0.0310593 -0.005714 -0.0018221 -0.0087364 0.1589009 -0.0171468 -0.0945854 -0.0171669 -0.106971 -0.0134546 -0.0166311 -0.0189023 -0.0160884 0.1559835 -0.1129488 0.049753 -0.016781 0.0448165 0.083723 -0.0009372 -0.0172385 -0.0002658 0.1588948 0.413615 -0.1549943 0.0051213 -0.1496485 0.0938035 -0.0266248 -0.0481816 0.0107352 0.2969496 unknown
polarizability: 190.8423695|1.8587946|138.7520667|5.422998|6.1076373|57.0585779 unknown
InChI: InChI=1S/C10H8ClNO/c11-10-7(6-13)5-12-9-4-2-1-3-8(9)10/h1-5,13H,6H2
charge 0 multiplicity 1
21 atoms
Cl 1.407948 -2.434491 0.052382
O  3.804502 -0.34202 -0.945004
N  -0.132611 1.974917 0.183723
C  -0.62042 -0.469176 0.018417
C  -1.035091 0.926771 0.063277
C  1.714257 0.334405 0.238546
C  0.786838 -0.69936 0.112028
C  -1.616407 -1.488518 -0.109876
C  1.171334 1.668419 0.263623
C  3.214882 0.117773 0.32443
C  -2.428517 1.239328 -0.022476
C  -2.968089 -1.146681 -0.189265
C  -3.378407 0.223548 -0.145706
H  -1.303435 -2.536551 -0.145263
H  1.867128 2.512711 0.351976
H  3.717932 1.075915 0.529884
H  3.451303 -0.59284 1.142518
H  -2.708513 2.296326 0.012638
H  -3.723124 -1.933946 -0.287162
H  -4.442927 0.472371 -0.210759
H  3.482617 -1.2642 -1.12093
