program: Gaussian 09
title: 000224382
version: EM64L-G09RevD.01
frameworkgroup: C1[X(C16H12ClN)]
method: RPBEPBE
basis: SDD
operation: Freq
keyword: #p
keyword: freq=noraman
keyword: PBEPBE/SDD
title: #p freq=noraman PBEPBE/SDD
converged: YES YES NO NO
title: Mulliken charges:
elementType: Cl N C C C C C C C C C C C C C C C C H H H H H H H H H H H H
charge: -0.061119 -0.008846 -0.140168 0.365046 0.435269 -0.095016 -0.460011 0.467632 -0.818717 -0.398938 -0.324840 -0.329707 -0.362653 -0.249912 -0.225257 -0.236150 -0.235268 -0.224774 0.247609 0.236420 0.223194 0.256500 0.234725 0.263888 0.255180 0.229113 0.231705 0.256817 0.233090 0.235188
chargesum: 0.00000
title: Mulliken charges with hydrogens summed into heavy atoms:
elementType: Cl N C C C C C C C C C C C C C C C C
charge: -0.061119 -0.008846 -0.140168 0.365046 0.435269 -0.095016 -0.212402 0.467632 -0.102603 -0.164213 -0.060952 -0.329707 -0.107473 -0.020799 0.006448 0.020667 -0.002178 0.010413
polarizability: 2.90737967e+02 -1.79130550e+00 1.72203907e+02 -1.38507058e+01 -3.47272768e+00 1.17744854e+02
1716.lowfreq: -8.8591 -5.0778 -0.0023 -0.0017 -0.0013 5.9146 33.4388 50.7936 73.7064
frequency: 33.3612 50.7793 73.7021 100.7480 132.9843 140.7749 156.8273 208.9758 256.2332 276.3673 284.8966 306.6726 372.9436 400.7852 428.2846 444.6675 455.7185 480.6307 482.2021 542.9923 559.4291 577.4674 613.7455 644.4623 686.5085 713.4987 717.0126 734.4515 760.4201 768.0318 800.9554 805.5425 869.2469 874.6482 886.6472 917.2711 950.7913 968.8059 986.3199 989.5101 995.2247 1008.6542 1017.3933 1021.2766 1051.1262 1053.6956 1121.1083 1122.1115 1155.0170 1171.6621 1176.5845 1219.9575 1246.0801 1252.7932 1293.9156 1305.9493 1352.1460 1363.2707 1395.9779 1402.3002 1416.8915 1424.5187 1441.9090 1463.0506 1470.2908 1470.8913 1495.0332 1549.0914 1568.5480 1599.2134 1606.0360 1625.3169 2982.1709 3065.6854 3084.6906 3119.8233 3121.6764 3136.6938 3137.0968 3149.7135 3154.7083 3163.6413 3170.4116 3175.7866
redmass: 6.2204 5.3911 4.4632 1.3897 2.5365 5.0331 4.2009 5.3388 4.2342 4.6667 3.4627 5.0544 5.6979 7.0796 3.7561 4.3809 3.8899 4.0305 2.9236 5.4180 3.7478 4.5957 6.9473 6.3640 6.7212 5.3688 5.7802 3.3877 1.3192 1.3327 3.5591 3.5270 1.4478 1.4891 4.7884 1.5270 1.3932 1.3832 1.6734 3.3684 1.3274 1.6417 2.1259 4.2881 1.5671 2.0834 1.7047 1.6561 1.5214 1.0587 1.5010 1.7852 1.9239 1.6575 2.6218 2.2677 5.3829 7.7339 2.5975 1.2125 3.0394 3.7587 2.6993 1.0621 1.4924 3.0959 1.9022 7.4557 6.1959 6.1223 7.2655 6.7161 1.0366 1.0971 1.0996 1.0904 1.0887 1.0856 1.0892 1.0906 1.0948 1.0956 1.0994 1.1000
irintensity: 0.4610 1.5538 1.0359 1.7466 1.2777 0.2573 0.5643 0.4142 0.3741 0.3841 1.7630 0.8607 1.2166 7.0928 1.3915 4.3278 2.5531 2.3792 8.7016 2.8255 0.7942 1.4752 5.3443 10.7610 7.0893 6.0208 3.0766 12.6271 51.4768 94.4575 3.7018 5.8546 0.6882 7.4055 0.7374 14.2066 1.6437 5.0418 5.2500 14.7474 0.0972 27.0762 7.4174 27.1528 10.4696 9.5220 1.8632 7.9123 2.2311 0.8952 2.5895 0.1856 1.5697 1.5781 16.9696 6.2375 12.5848 4.0551 23.8176 15.4826 14.4738 34.4374 2.6689 14.0348 9.4695 11.3793 35.7114 6.1324 9.3727 10.7564 6.6230 1.0975 26.7894 7.7754 20.6254 2.8281 15.3636 0.9874 12.6307 11.4754 26.8398 11.9887 26.1069 16.4751
temp: 298.150 k
press: 1.00000 atm
elementType: 17 7 6 6 6 6 6 6 6 6 6 6 6 6 6 6 6 6 1 1 1 1 1 1 1 1 1 1 1 1
symmnumber: 1
zpe: 602765.0 jmol-1
zpe.correction: 0.229581 hartree
zpe.thermalcorrener: 0.244316 hartree
zpe.thermalcorrenthalpy: 0.245261 hartree
zpe.thermalcorrgfe: 0.186935 hartree
zpe.sumelectzpe: -1130.498772 hartree
zpe.sumelectthermal: -1130.484036 hartree
zpe.sumelectthermalent: -1130.483092 hartree
zpe.sumelectthermalfe: -1130.541418 hartree
dipole: -0.0954 0.4083 -2.1413
dipole: 2.1820
quadrupole: -89.2429 -105.2184 -112.9635
quadrupole: -5.0539 -2.0164 -2.2316
quadrupole: 13.2321 -2.7435 -10.4886 -5.0539 -2.0164 -2.2316
hfenergy: -1130.7283528 hartree
pointgroup: C01 [X(C16H12Cl1N1)]
dipole: 0.0146181 -0.6117673 -0.602061 debye
polarizability: 291.323749|8.4000895|158.1387669|2.6299804|-24.5832909|131.2242126 unknown
InChI: InChI=1S/C16H12ClN/c1-11-10-12-6-2-5-9-15(12)18-16(11)13-7-3-4-8-14(13)17/h2-10H,1H3
charge 0 multiplicity 1
30 atoms
Cl -2.097993 -0.568998 2.53761
N  0.509952 0.841399 -0.240563
C  -0.310193 -0.220619 -0.095389
C  0.164914 -1.583727 0.06424
C  2.455781 -0.672596 0.004844
C  1.881584 0.640986 -0.188309
C  1.549697 -1.775067 0.113606
C  -1.777545 0.090068 -0.187329
C  -0.791229 -2.756514 0.127704
C  3.880319 -0.811109 0.05638
C  2.745765 1.773315 -0.328314
C  -2.690217 -0.042573 0.884379
C  -2.294615 0.589188 -1.413668
C  4.703059 0.310149 -0.078676
C  4.132397 1.609802 -0.272922
C  -4.058506 0.269034 0.763378
C  -3.66119 0.904431 -1.564753
C  -4.547889 0.73755 -0.476305
H  1.953537 -2.789075 0.225338
H  -1.547638 -2.704718 -0.676366
H  -0.247822 -3.711873 0.027727
H  -1.33991 -2.77571 1.087019
H  4.316234 -1.806837 0.203389
H  2.281824 2.753994 -0.471956
H  -1.596086 0.73363 -2.244303
H  5.792381 0.200732 -0.03695
H  4.792316 2.478089 -0.376418
H  -4.722312 0.159213 1.625544
H  -4.030945 1.283653 -2.523131
H  -5.610472 0.981184 -0.580605
