program: Gaussian 09
title: 000224376
version: EM64L-G09RevD.01
frameworkgroup: C1[X(C14H18N2O2S)]
method: RPBEPBE
basis: SDD
operation: Freq
keyword: #p
keyword: freq=noraman
keyword: PBEPBE/SDD
title: #p freq=noraman PBEPBE/SDD
converged: YES YES NO NO
title: Mulliken charges:
elementType: S O O N N C C C C C C C C C C C C C C H H H H H H H H H H H H H H H H H H
charge: -0.069027 -0.238858 -0.264964 -0.035421 -0.448226 -0.376494 -0.357881 -0.302995 -0.301891 -0.228191 -0.622478 0.571294 -0.583480 -0.407895 0.485539 -0.193505 -0.479718 0.211655 -0.797999 0.259999 0.239281 0.231692 0.258575 0.196058 0.229924 0.227193 0.206663 0.279498 0.230054 0.308586 0.267803 0.227714 0.221600 0.310958 0.237607 0.269639 0.237688
chargesum: 0.00000
title: Mulliken charges with hydrogens summed into heavy atoms:
elementType: S O O N N C C C C C C C C C C C C C C
charge: -0.069027 -0.238858 -0.264964 -0.035421 -0.137268 0.122786 0.132387 0.122987 0.131965 -0.228191 -0.112926 0.571294 -0.274894 -0.140091 0.485539 0.034208 -0.258118 0.211655 -0.053065
polarizability: 2.32779405e+02 3.02118321e+01 2.03827108e+02 1.11010150e+01 -1.04738505e+01 1.35809606e+02
1716.lowfreq: -74.9981 -0.0017 -0.0004 0.0012 4.5425 7.8773 9.5385 14.2372 33.5389
frequency: -74.9936 13.1925 33.5027 49.3426 59.5432 61.7363 90.9248 97.7752 118.9845 169.7674 202.7503 235.9649 255.5612 285.9383 295.9806 330.1535 352.2607 379.6238 396.0934 417.9006 440.5544 460.1270 475.4468 498.7424 521.4262 548.0569 582.6492 593.8118 624.4448 647.6500 654.4123 696.7972 715.7010 761.7329 793.4454 808.8647 825.3750 831.3882 899.2407 900.9372 920.3320 932.7049 935.1854 959.1762 983.0538 984.6549 1000.1989 1011.4082 1023.1044 1030.8607 1045.3682 1070.8062 1095.9414 1100.9517 1111.4293 1155.8084 1163.3222 1183.9119 1186.2336 1203.6223 1230.7973 1248.7300 1260.8825 1271.8386 1274.9645 1294.1868 1310.9202 1325.3947 1339.7136 1347.3686 1367.4613 1375.4072 1386.6523 1427.9198 1440.5896 1445.9351 1448.6393 1451.3869 1456.3405 1467.9676 1468.4316 1472.7279 1488.2743 1519.7117 1601.9676 1615.8607 1630.7116 2951.8092 2963.4738 2987.0540 2987.6278 2995.3102 2998.3103 3063.0712 3071.4188 3072.6960 3086.9919 3091.2609 3112.0255 3123.6934 3135.1152 3136.6156 3156.7016 3167.3234 3521.5471
redmass: 1.0519 6.1815 5.2305 4.6957 5.2017 4.1010 3.9255 4.8102 5.8152 3.5766 3.3522 5.3455 3.8652 3.3109 3.0674 4.7624 3.5876 4.6479 2.2107 2.4182 2.8355 2.7332 4.3568 5.2854 4.1762 3.2227 2.5999 3.6267 3.0352 1.2452 5.2635 2.6220 3.1733 3.4379 4.0522 1.8026 1.8210 2.6668 2.0523 1.6140 3.4557 1.8347 2.6407 1.9970 1.3910 5.0687 1.8310 2.4132 2.3128 1.6602 2.1635 3.8043 2.0666 1.9971 3.0827 1.5365 1.7593 1.1006 1.1250 1.8099 3.0940 1.3564 1.5781 1.8919 1.3729 1.3957 1.3870 1.2541 1.2412 1.3639 1.2631 1.2418 6.7954 2.4815 1.4354 1.1377 1.0848 1.2533 1.1070 1.4911 1.0547 2.0938 1.3094 2.0495 6.0459 5.9857 4.9517 1.0683 1.0676 1.0607 1.0383 1.0680 1.0652 1.1015 1.0960 1.0983 1.0961 1.0986 1.0887 1.0932 1.0903 1.0979 1.0985 1.0930 1.0764
irintensity: 0.0429 1.6023 0.8273 3.7989 7.5251 3.8032 1.3722 0.9013 2.1155 1.3529 2.8047 6.2013 1.4335 8.8609 14.2197 2.2460 0.3107 0.2678 2.2594 1.6866 4.2184 0.9468 8.6292 4.3959 16.4733 3.5533 7.3808 4.9362 6.7513 48.5488 2.3859 10.8233 21.1228 28.8545 8.3541 57.3404 0.1405 4.6758 2.0059 3.8962 3.4391 27.7792 11.3239 14.2086 0.4077 0.5338 20.1604 7.7320 45.5827 7.4900 41.9074 39.3201 20.2223 18.6038 7.9069 20.3914 20.0663 2.3198 5.2039 15.1082 81.9417 61.7280 49.2634 25.9386 26.0861 4.1274 42.6674 1.9964 0.9644 6.9130 0.3815 41.6559 57.9955 185.3115 118.1316 30.7399 1.3905 5.1118 5.7204 89.5556 33.1207 18.7722 15.2844 278.8105 83.1930 58.3730 113.6514 45.0310 52.6850 30.1920 9.1574 47.8135 13.9137 18.1766 3.4514 14.6840 27.0583 30.1121 15.8971 7.3946 5.4511 6.5363 18.8638 8.7640 12.4554
temp: 298.150 k
press: 1.00000 atm
elementType: 16 8 8 7 7 6 6 6 6 6 6 6 6 6 6 6 6 6 6 1 1 1 1 1 1 1 1 1 1 1 1 1 1 1 1 1 1
symmnumber: 1
zpe: 788450.9 jmol-1
zpe.correction: 0.300305 hartree
zpe.thermalcorrener: 0.317969 hartree
zpe.thermalcorrenthalpy: 0.318913 hartree
zpe.thermalcorrgfe: 0.252007 hartree
zpe.sumelectzpe: -1200.889472 hartree
zpe.sumelectthermal: -1200.871808 hartree
zpe.sumelectthermalent: -1200.870864 hartree
zpe.sumelectthermalfe: -1200.937770 hartree
dipole: 4.9324 1.0443 2.9048
dipole: 5.8187
quadrupole: -99.7073 -133.0520 -120.5030
quadrupole: -8.2026 7.5926 -5.8546
quadrupole: 18.0468 -15.2979 -2.7489 -8.2026 7.5926 -5.8546
hfenergy: -1201.189777 hartree
pointgroup: C01 [X(C14H18N2O2S1)]
dipole: 1.8152375 -1.0875975 -0.8733646 debye
polarizability: 213.8660673|-32.5761227|222.0192939|-3.2127681|-18.0611111|136.5307582 unknown
InChI: InChI=1S/C14H18N2O2S/c1-11(17)15-13-4-2-3-12(9-13)10-14(19)16-5-7-18-8-6-16/h2-4,9,15H,5-8,10H2,1H3
charge 0 multiplicity 1
37 atoms
S  -2.582217 3.252973 0.388331
O  -4.271239 -1.611546 -0.849328
O  2.301528 -2.522132 1.71333
N  -2.488041 0.607518 -0.297942
N  3.524167 -1.153925 0.245633
C  -1.983062 -0.789808 -0.319857
C  -3.665637 0.781546 -1.185923
C  -3.121064 -1.765674 0.051845
C  -4.765833 -0.222782 -0.79659
C  -1.956031 1.64434 0.429864
C  -0.729064 1.350496 1.300966
C  0.573722 1.19468 0.507098
C  1.4095 0.078854 0.746033
C  0.962302 2.183417 -0.431476
C  2.638129 -0.054668 0.047084
C  2.187199 2.049494 -1.120761
C  3.025309 0.940313 -0.889166
C  3.343435 -2.297152 1.029248
C  4.527062 -3.265304 0.986113
H  -1.131426 -0.917152 0.361476
H  -1.630229 -1.014404 -1.346005
H  -3.346407 0.603246 -2.231634
H  -4.01752 1.823126 -1.086804
H  -3.436227 -1.593591 1.104198
H  -2.787532 -2.809694 -0.065182
H  -5.602295 -0.1808 -1.512614
H  -5.139911 0.005664 0.224228
H  -0.637908 2.210081 1.985342
H  -0.893458 0.455443 1.931181
H  1.133155 -0.689948 1.4720
H  0.309927 3.045383 -0.609454
H  2.493816 2.814228 -1.842806
H  3.974134 0.845446 -1.433409
H  4.405645 -1.099907 -0.270983
H  4.698073 -3.645384 -0.038324
H  4.306696 -4.116636 1.645516
H  5.457999 -2.779342 1.33257
