program: Gaussian 09
title: 000224269
version: EM64L-G09RevD.01
frameworkgroup: C1[X(C9H9N3O4)]
method: RPBEPBE
basis: SDD
operation: Freq
keyword: #pfreq=noraman
keyword: PBEPBE/SDD
title: #p freq=noraman PBEPBE/SDD
converged: YES YES NO NO
title: Mulliken charges:
elementType: O O O O N N N C C C C C C C C C H H H H H H H H H
charge: -0.284106 -0.277174 -0.203011 -0.204857 -0.404662 0.026618 -0.598170 0.297551 0.177479 -0.330500 -0.314871 0.390022 -0.429671 -0.360224 -0.374744 0.213792 0.288476 0.230915 0.268482 0.269420 0.359839 0.289356 0.288913 0.349446 0.331679
chargesum: 0.00000
title: Mulliken charges with hydrogens summed into heavy atoms:
elementType: O O O O N N N C C C C C C C C C
charge: -0.284106 -0.277174 -0.203011 -0.204857 -0.044823 0.026618 0.082956 0.297551 0.177479 -0.042024 -0.083956 0.390022 0.108231 -0.070867 -0.085830 0.213792
polarizability: 2.21167792e+02 -9.13035498e+00 1.40078730e+02 -3.72907675e+00 -3.55154954e+00 5.69435697e+01
1716.lowfreq: -6.1554 -0.0006 0.0003 0.0008 2.2078 6.4371 12.3718 37.3313 55.1408
frequency: 11.8259 37.3229 55.1339 63.9548 69.9456 82.9775 153.0237 170.5414 224.5078 256.5965 274.8436 291.7377 373.3589 406.5403 457.3252 475.5012 487.1137 494.7276 523.1813 546.7992 595.7194 624.2487 634.7112 652.2711 676.8148 681.9461 687.7538 766.6815 775.7526 811.4633 846.7262 887.7851 895.2453 984.4732 986.4814 1004.5096 1015.3417 1049.9560 1080.5564 1092.7329 1111.0461 1170.4769 1186.2979 1200.3044 1220.7234 1244.6950 1290.0635 1308.3508 1364.4309 1385.7801 1402.9772 1410.5048 1464.7275 1473.5338 1499.5120 1566.0131 1598.5557 1606.8971 1610.6923 1655.1109 2976.9645 3018.8123 3144.8860 3164.2267 3184.7685 3187.8876 3466.2012 3519.7872 3670.6062
redmass: 5.7541 4.8689 7.2041 7.6366 4.8984 8.0929 4.0422 5.4891 6.3857 6.9243 5.9029 11.0816 4.8726 2.8268 3.5735 1.5574 7.6607 4.4893 4.8906 1.2695 5.4141 6.2965 1.4661 3.1812 1.6283 4.4444 3.8402 4.7230 7.7671 5.1154 1.3593 1.5829 3.4620 1.6672 1.6439 3.1112 1.3702 2.7044 2.7798 2.9081 1.3220 2.3920 1.7568 1.0919 5.7280 1.4729 1.5516 1.5859 7.1906 3.5909 11.5380 3.9587 1.9332 1.2146 2.4549 9.8789 2.0291 3.1309 6.5564 3.3160 1.0589 1.1014 1.0903 1.0899 1.0947 1.0962 1.0775 1.0453 1.1045
irintensity: 0.1014 1.9105 1.4517 0.9432 2.1342 16.4118 12.5636 18.8442 5.3832 7.0187 1.8369 1.4697 1.5772 0.1606 5.7214 2.9259 15.8755 3.7308 17.2025 202.2466 6.2263 0.2519 41.1896 50.0860 87.8836 35.7711 62.4661 8.0542 38.0247 3.0986 15.8915 45.2973 33.3576 2.6477 0.0321 4.9395 0.2404 0.7236 3.3401 25.2537 21.3743 1.9469 47.4070 0.0109 323.1262 13.3597 17.8929 10.1672 96.7995 278.1003 3.0050 43.6490 167.7138 26.5968 294.5161 196.0315 61.9734 17.9888 13.1756 249.0585 31.7814 13.0521 9.7421 1.6105 1.2762 1.1133 135.8078 58.6597 36.1874
temp: 298.150 k
press: 1.00000 atm
elementType: 8 8 8 8 7 7 7 6 6 6 6 6 6 6 6 6 1 1 1 1 1 1 1 1 1
symmnumber: 1
zpe: 474396.9 jmol-1
zpe.correction: 0.180688 hartree
zpe.thermalcorrener: 0.195418 hartree
zpe.thermalcorrenthalpy: 0.196362 hartree
zpe.thermalcorrgfe: 0.135644 hartree
zpe.sumelectzpe: -812.300623 hartree
zpe.sumelectthermal: -812.285893 hartree
zpe.sumelectthermalent: -812.284949 hartree
zpe.sumelectthermalfe: -812.345667 hartree
dipole: -8.6945 0.4258 0.0848
dipole: 8.7053
quadrupole: -79.5778 -102.1048 -93.0168
quadrupole: 2.8343 -0.1498 -1.8294
quadrupole: 11.9886 -10.5383 -1.4503 2.8343 -0.1498 -1.8294
hfenergy: -812.4813113 hartree
pointgroup: C01 [X(C9H9N3O4)]
dipole: -3.4217684 0.1340475 -0.0613319 debye
dipolederiv: -0.8165976 0.18323 -0.0370436 -0.1642589 -0.9025906 0.0475045 -0.0086651 0.0723114 -0.3746636 -0.9769096 0.0232291 -0.0103584 0.2399627 -0.8509038 0.0425801 -0.0356083 0.041776 -0.3570138 -0.8709008 -0.1485761 0.0633905 -0.1495697 -0.5338222 0.0972821 0.0681174 0.097728 -0.2578219 -0.6636149 0.1825941 -0.0421769 0.2153222 -0.7210114 0.1435749 -0.0480337 0.1414178 -0.2691935 -1.1424421 -0.2642801 0.00624 -0.625201 -0.6742648 0.0227826 0.0364685 0.0447116 -0.4203244 1.869965 -0.1723222 0.0030629 -0.2168742 1.0577697 -0.2542531 0.0041181 -0.2538164 0.2690726 -1.3863454 0.1105461 -0.0190797 -0.0426367 -0.254169 -0.0411706 -0.0103804 -0.0384988 -0.6971851 -0.1301577 0.0452788 -0.0077665 0.1034257 0.0221817 -0.0177236 0.0152762 -0.0220786 0.0275013 1.668401 0.0732951 0.0317578 0.4231744 1.1647979 -0.0776721 -0.0014651 -0.1251831 0.2342208 -0.31001 -0.1160265 0.0382591 -0.0351851 0.0642043 -0.0506634 0.0251292 -0.0354305 -0.0914868 -0.1172567 0.1791649 -0.0650444 0.1715249 -0.0819393 -0.0256863 -0.0979258 -0.0149428 -0.1221749 -0.6776454 0.164202 -0.0319007 0.2224306 0.0261696 0.0026924 -0.04474 0.0041721 0.0584954 0.4303503 -0.0797167 0.0069242 -0.3175491 -0.1438956 0.0353828 0.0376731 0.0461215 0.34161 0.1445135 0.1168506 -0.0426632 -0.1878972 -0.0340044 -0.0162459 0.0467457 -0.0249481 -0.0996889 0.0911971 -0.1576549 0.0430062 0.0792362 -0.0392822 -0.0217018 -0.0370422 -0.0123029 -0.0924725 1.8546436 -0.1033717 0.0384561 -0.0961015 1.0047593 -0.064859 0.0474743 -0.0709133 0.2063131 0.1491904 0.0410838 -0.011708 0.0094308 0.0373926 0.0372766 -0.0150302 0.0302969 0.1422472 -0.0139681 -0.0846066 0.0328012 -0.1006166 0.0409281 0.0361234 0.0487004 0.0298788 0.1343657 -0.0740096 -0.0139255 0.0450812 0.0725666 0.0421583 -0.0646341 0.0718611 -0.0653402 -0.0067412 -0.0587973 -0.0266402 -0.0393626 0.0583753 0.0678256 0.0533376 -0.0851971 0.0467392 -0.032144 0.3917094 0.0590328 -0.0041154 0.327771 0.2471497 0.0140585 -0.0241928 0.0063019 0.3047064 0.070135 -0.0575554 0.0204846 -0.0258239 0.0963783 0.023751 0.0150805 0.0236484 0.1631327 0.1160249 0.0385569 -0.0098195 0.0142751 0.0540841 0.0364208 0.0015076 0.0352669 0.1605791 0.2003699 0.0013825 -0.0048751 0.0325113 0.1690309 0.0200389 -0.007346 0.0202321 0.3913181 0.2521552 0.0062293 -0.0035498 -0.0082928 0.1410531 0.0218037 -0.0025255 0.0228523 0.3873484 unknown
polarizability: 221.3771753|-8.4002347|135.8650651|1.173154|-18.3560379|60.9478521 unknown
InChI: InChI=1S/C9H9N3O4/c10-8(13)5-11-9(14)6-1-3-7(4-2-6)12(15)16/h1-4,11H,5,10H2
charge 0 multiplicity 1
25 atoms
O  -1.520525 2.299862 -0.411377
O  -3.906314 -1.943435 -0.026064
O  5.212781 0.370694 -0.266318
O  4.615576 -1.732552 0.383835
N  -2.230687 0.11392 -0.160685
N  4.330613 -0.523223 0.031883
N  -5.830032 -0.647567 -0.179038
C  0.189102 0.586989 -0.162172
C  -1.242035 1.065593 -0.251875
C  1.199529 1.532541 -0.476176
C  0.56071 -0.727534 0.227958
C  2.897594 -0.136644 -0.034584
C  -3.637841 0.485218 -0.230508
C  2.559347 1.179717 -0.418072
C  1.917348 -1.09762 0.294112
C  -4.464872 -0.809488 -0.135913
H  0.883951 2.541729 -0.757913
H  -0.192451 -1.473176 0.503722
H  -3.902786 1.179585 0.591365
H  -3.856321 1.021495 -1.17558
H  -2.063707 -0.896903 -0.085126
H  3.352926 1.891554 -0.658766
H  2.227428 -2.101718 0.594095
H  -6.422788 -1.475522 -0.120951
H  -6.266247 0.268891 -0.268654
