program: Gaussian 09
title: 000224245
version: EM64L-G09RevD.01
frameworkgroup: C1[X(C16H32O)]
method: RPBEPBE
basis: SDD
operation: Freq
keyword: #pfreq=noraman
keyword: PBEPBE/SDD
title: #p freq=noraman PBEPBE/SDD
converged: YES YES NO NO
title: Mulliken charges:
elementType: O C C C C C C C C C C C C C C C C H H H H H H H H H H H H H H H H H H H H H H H H H H H H H H H H
charge: -0.293844 -0.021099 -0.505877 -0.483763 -0.430282 -0.005142 -0.362555 -0.385944 -0.387322 -0.385699 -0.701644 -0.384643 -0.382084 -0.372592 -0.353402 -0.356704 -0.696996 0.218579 0.223026 0.223890 0.208593 0.192813 0.227755 0.223709 0.219869 0.230059 0.181325 0.194041 0.186288 0.197531 0.192459 0.191642 0.193387 0.238042 0.202615 0.218847 0.192370 0.193719 0.191666 0.191094 0.189456 0.189036 0.187408 0.187237 0.194813 0.194655 0.209554 0.209479 0.214635
chargesum: 0.00000
title: Mulliken charges with hydrogens summed into heavy atoms:
elementType: O C C C C C C C C C C C C C C C C
charge: -0.293844 0.197481 -0.058961 -0.032298 -0.028877 0.214727 0.048828 -0.005615 0.002668 -0.000671 -0.042140 0.001446 0.000676 0.005901 0.021243 0.032764 -0.063329
polarizability: 2.28212300e+02 -3.00482071e+00 1.55526449e+02 -2.29827438e+00 -2.92879608e-01 1.47181430e+02
1716.lowfreq: -0.0014 -0.0005 0.0012 5.3125 7.0955 18.0241 24.5630 31.7692 41.4782
frequency: 22.7279 29.9961 37.7932 47.2853 51.8810 67.7417 74.3116 85.0690 108.4630 117.2458 120.2103 139.4655 146.7667 160.0485 162.1473 176.3334 231.0235 233.9681 235.2312 275.6703 321.8974 339.4157 376.0638 408.5707 417.9570 454.4645 489.3183 501.1058 640.6440 684.8013 720.6836 722.5252 727.5608 735.9910 751.0570 777.4019 801.9993 824.5255 852.7658 871.7602 879.4183 888.6150 921.0663 938.4319 959.8862 979.8551 983.5341 991.9697 1002.5973 1015.0743 1026.0604 1027.1778 1046.9888 1055.7530 1062.7409 1074.0733 1079.4490 1081.4042 1082.7686 1096.3876 1103.7875 1123.6707 1151.0540 1182.3369 1183.8525 1190.0105 1204.4673 1208.6471 1231.5505 1235.1698 1252.8992 1260.6425 1264.6056 1278.9136 1281.4909 1282.5345 1287.5476 1292.8191 1295.4270 1298.1647 1299.2320 1301.2482 1313.9880 1322.4713 1335.0837 1342.7942 1350.7884 1354.1592 1357.0539 1358.7390 1362.4953 1381.7596 1390.0027 1444.2571 1458.6865 1459.1984 1459.5220 1462.7549 1463.3500 1466.7664 1469.7494 1471.8685 1473.3750 1477.3858 1477.9058 1479.5386 1482.4677 1486.4362 1488.7408 2946.6584 2948.5208 2949.3321 2950.3931 2952.6065 2955.5515 2956.7916 2960.9707 2964.0178 2967.6740 2971.2365 2978.0104 2981.0032 2984.0918 2984.3949 2989.1794 2996.7732 3002.4461 3007.2653 3009.6735 3016.4762 3020.3894 3022.0907 3031.4481 3040.5644 3049.2588 3067.8787 3068.8991 3069.8141 3075.6654 3083.7483 3092.9115
redmass: 4.0117 3.6291 2.2679 2.5042 3.2209 3.4871 1.7168 2.8998 1.7781 3.1620 2.6163 1.9802 2.4377 2.2484 2.2759 2.9536 1.3747 1.6306 1.1567 3.0299 3.0441 2.5872 2.3575 2.9072 2.8926 2.8575 2.8749 2.9488 2.2241 3.1490 1.0584 1.0744 1.1935 1.6192 1.4554 1.3746 1.7643 1.4394 1.9594 1.7985 1.8019 1.9025 1.3453 1.5479 2.3712 3.2914 1.3811 3.1662 3.0927 2.1336 1.2704 2.1023 2.7721 1.8421 2.1369 2.0768 2.0776 2.3280 2.1280 1.8378 1.5187 2.7312 1.9657 1.8588 1.5725 1.6591 1.4337 1.4359 1.3239 1.3710 1.3309 1.3008 1.3446 1.0274 1.2656 1.2238 1.0668 1.1288 1.3136 1.1171 1.2288 1.2370 1.3048 1.3343 1.3579 1.3826 1.4512 1.6930 1.6244 1.5946 1.5867 1.2398 1.2181 1.0856 1.0578 1.0739 1.0724 1.0678 1.0696 1.0792 1.0748 1.0828 1.0691 1.0831 1.0431 1.0832 1.0885 1.0932 1.0940 1.0587 1.0584 1.0588 1.0590 1.0596 1.0596 1.0600 1.0617 1.0616 1.0584 1.0368 1.0362 1.0958 1.0953 1.0857 1.0982 1.1004 1.0736 1.0991 1.0759 1.0884 1.0935 1.0854 1.1046 1.1044 1.1025 1.1007 1.1015 1.0993 1.0993 1.1045 1.1001
irintensity: 0.1052 0.0623 0.8926 0.8331 2.1739 0.2739 0.2322 0.6523 0.0652 0.3702 0.0844 0.0169 0.0203 0.0842 0.2141 0.0711 0.1597 0.0889 0.0090 0.0538 0.5377 1.3220 0.3688 2.2565 0.7187 2.7858 0.4033 0.2030 9.3004 0.4649 18.4062 0.1973 5.1287 5.1637 2.7190 3.2876 0.8976 1.5995 14.3522 5.8594 15.7702 3.3707 1.7597 5.1438 3.9993 0.1886 2.8891 14.9792 6.2932 39.0898 0.4436 14.6805 20.1581 6.0350 5.5006 6.3291 0.4306 0.3024 4.4096 26.4722 5.7936 10.6942 2.8795 1.5071 16.2874 29.8562 4.1696 0.4158 1.7179 0.6490 2.3034 0.1919 1.0686 0.4203 0.2519 0.8228 0.7141 0.7911 1.2607 0.2473 1.3194 4.5367 3.0422 0.5362 11.7860 12.9642 1.5261 0.1858 0.2200 0.6613 4.8770 25.4698 11.2208 2.7266 6.0282 0.0530 0.3777 0.0736 0.0495 0.2572 5.0405 0.4016 16.3511 1.5916 12.0378 13.5777 1.8570 4.2595 36.8446 3.0147 0.3326 0.1261 0.2357 2.2937 15.7098 1.4617 4.5934 134.9005 198.1365 36.0628 26.0475 1.1553 0.0677 21.6131 2.8942 2.2105 11.7076 3.5617 23.0495 79.1736 8.7756 3.5610 1.2936 138.6980 191.8515 98.3699 17.6260 55.7679 51.6792 56.3402 36.8258
temp: 298.150 k
press: 1.00000 atm
elementType: 8 6 6 6 6 6 6 6 6 6 6 6 6 6 6 6 6 1 1 1 1 1 1 1 1 1 1 1 1 1 1 1 1 1 1 1 1 1 1 1 1 1 1 1 1 1 1 1 1
symmnumber: 1
zpe: 1177330.5 jmol-1
zpe.correction: 0.448421 hartree
zpe.thermalcorrener: 0.469939 hartree
zpe.thermalcorrenthalpy: 0.470883 hartree
zpe.thermalcorrgfe: 0.395049 hartree
zpe.sumelectzpe: -702.698519 hartree
zpe.sumelectthermal: -702.677001 hartree
zpe.sumelectthermalent: -702.676057 hartree
zpe.sumelectthermalfe: -702.751891 hartree
dipole: -1.2690 -1.3721 0.5643
dipole: 1.9523
quadrupole: -99.5289 -110.5774 -107.8666
quadrupole: 5.9890 -4.0019 2.6894
quadrupole: 6.4621 -4.5864 -1.8756 5.9890 -4.0019 2.6894
hfenergy: -703.14694 hartree
pointgroup: C01 [X(C16H32O1)]
dipole: 0.5063865 -0.5317945 -0.2252447 debye
polarizability: 228.2020098|3.6229045|155.5671095|-1.243589|0.4669188|147.1510593 unknown
InChI: InChI=1S/C16H32O/c1-3-4-5-6-7-8-9-10-11-12-16-14-13-15(2)17-16/h15-16H,3-14H2,1-2H3
charge 0 multiplicity 1
49 atoms
O  4.746737 0.98375 0.317526
C  4.569146 -0.438809 0.744209
C  5.849956 -1.172028 0.272587
C  6.304945 -0.34768 -0.960611
C  3.263173 -1.001213 0.148784
C  5.945297 1.105501 -0.564195
C  2.012026 -0.208754 0.584045
C  0.701902 -0.766577 -0.014539
C  -0.553353 0.016143 0.432783
C  -1.86998 -0.551902 -0.143012
C  7.065169 1.847657 0.185258
C  -3.123785 0.232017 0.306206
C  -4.442981 -0.344264 -0.25555
C  -5.695689 0.441974 0.193117
C  -7.016288 -0.136495 -0.363127
C  -8.268063 0.652289 0.085111
C  -9.5831 0.067448 -0.474303
H  4.488812 -0.420664 1.849336
H  6.625522 -1.143722 1.059263
H  5.65376 -2.229182 0.02359
H  3.338928 -1.00063 -0.957733
H  3.160624 -2.060144 0.468595
H  5.737216 -0.654096 -1.857828
H  7.380733 -0.465685 -1.176738
H  5.622006 1.701808 -1.438295
H  2.145603 0.849958 0.289652
H  1.941797 -0.21963 1.69258
H  0.767912 -0.749983 -1.122852
H  0.588279 -1.833571 0.273267
H  -0.447751 1.078994 0.130502
H  -0.608747 0.013917 1.541714
H  -1.974402 -1.614515 0.16212
H  -1.815628 -0.55184 -1.252016
H  6.679712 2.79884 0.591265
H  7.909567 2.073573 -0.493543
H  7.444156 1.244467 1.030331
H  -3.171643 0.240445 1.415478
H  -3.023975 1.292424 -0.007373
H  -4.395177 -0.354977 -1.36479
H  -4.543535 -1.403991 0.06043
H  -5.596561 1.500882 -0.125993
H  -5.74103 0.455841 1.302476
H  -6.972367 -0.151715 -1.472514
H  -7.118023 -1.194802 -0.042684
H  -8.165851 1.70938 -0.235398
H  -8.310728 0.667206 1.193526
H  -9.577357 0.067585 -1.580821
H  -9.724729 -0.978209 -0.14107
H  -10.461634 0.650181 -0.140769
