program: Gaussian 09
title: 000224244
version: EM64L-G09RevD.01
frameworkgroup: C1[X(C7H12O)]
method: RPBEPBE
basis: SDD
operation: Freq
keyword: #pfreq=noraman
keyword: PBEPBE/SDD
title: #p freq=noraman PBEPBE/SDD
converged: YES YES NO NO
title: Mulliken charges:
elementType: O C C C C C C C H H H H H H H H H H H H
charge: -0.319323 -0.104375 -0.084302 -0.037443 -0.428502 -0.418017 -0.422072 -0.725045 0.218110 0.217486 0.192581 0.203232 0.227941 0.215028 0.200952 0.202271 0.205310 0.235890 0.211021 0.209255
chargesum: 0.00000
title: Mulliken charges with hydrogens summed into heavy atoms:
elementType: O C C C C C C C
charge: -0.319323 0.113736 0.133184 0.155138 0.002671 -0.002036 -0.014491 -0.068879
polarizability: 8.45579778e+01 7.50467984e-02 7.08090602e+01 7.24071636e-01 8.63965316e-01 6.25180490e+01
1716.lowfreq: -22.4256 -15.2360 -0.0006 -0.0005 0.0008 18.5500 99.3914 194.2255 218.7464
frequency: 99.2421 194.2107 218.7455 253.4308 306.5059 348.7055 422.2449 452.1749 560.7720 620.2873 695.0668 748.0698 800.1886 841.5691 856.7364 893.8764 942.5392 969.8952 980.9644 1030.4366 1054.3746 1075.2342 1091.7958 1121.1997 1150.3885 1169.2093 1209.6648 1239.7097 1261.4666 1286.6644 1314.6187 1330.2094 1342.1529 1347.2922 1360.4063 1383.1837 1406.5913 1453.1149 1460.4388 1472.3170 1473.6807 1481.4871 2945.3202 2971.7124 2976.4197 2986.2054 2986.8471 3032.6707 3043.5465 3051.4982 3065.1642 3070.4645 3081.2341 3091.7455
redmass: 2.5491 1.9402 1.3269 1.8863 2.3874 3.7080 2.5025 3.2813 2.8134 2.8733 3.8149 2.6117 3.2526 1.5376 2.6858 2.1535 2.4334 1.3903 1.4359 1.3385 1.6978 1.6836 1.8876 1.6638 1.3725 1.5150 1.5700 1.2531 1.2489 1.2915 1.2770 1.5087 1.5900 1.5441 1.4785 1.2780 2.7646 1.1147 1.0831 1.0879 1.0480 1.0629 1.0816 1.0626 1.0359 1.0607 1.0615 1.0965 1.1016 1.1030 1.0887 1.0981 1.1000 1.0935
irintensity: 1.1449 4.0591 0.9719 0.5168 1.3617 7.6453 1.1102 0.3754 2.4073 2.0490 7.5631 12.7109 16.4225 7.1028 9.8462 5.9604 4.7452 4.3393 9.4980 4.4908 1.4536 0.2701 2.2997 1.9375 0.3217 0.7334 0.1173 0.9473 0.8095 0.3181 2.7151 2.8223 0.0834 1.9243 0.8397 16.9865 2.8815 9.7745 6.6852 12.3733 12.8996 10.7645 26.6600 36.5292 31.3828 32.9396 38.4670 40.9842 25.9368 53.4088 14.8633 47.5260 39.8352 71.2327
temp: 298.150 k
press: 1.00000 atm
elementType: 8 6 6 6 6 6 6 6 1 1 1 1 1 1 1 1 1 1 1 1
symmnumber: 1
zpe: 460704.0 jmol-1
zpe.correction: 0.175473 hartree
zpe.thermalcorrener: 0.183207 hartree
zpe.thermalcorrenthalpy: 0.184152 hartree
zpe.thermalcorrgfe: 0.143784 hartree
zpe.sumelectzpe: -348.483602 hartree
zpe.sumelectthermal: -348.475868 hartree
zpe.sumelectthermalent: -348.474924 hartree
zpe.sumelectthermalfe: -348.515291 hartree
dipole: 0.4519 1.4593 -1.9264
dipole: 2.4586
quadrupole: -46.4436 -51.6267 -50.2039
quadrupole: -0.3833 0.2729 3.9064
quadrupole: 2.9812 -2.2020 -0.7791 -0.3833 0.2729 3.9064
hfenergy: -348.6590752 hartree
pointgroup: C01 [X(C7H12O1)]
dipole: -0.1560382 0.5795113 0.758602 debye
dipolederiv: -0.4303332 0.0277863 0.0230741 0.0181264 -0.5465248 -0.1038634 0.0355671 -0.1749191 -0.5463029 0.1733609 0.0261552 0.0429479 0.117426 0.3623228 -0.0192892 0.1324391 0.0112624 0.2442215 0.2454043 -0.0290186 -0.0335231 -0.120178 0.3417755 -0.0677686 -0.1125407 -0.0537099 0.1872813 0.0535718 -0.0386002 -0.0126778 0.0077155 0.0172993 0.0504939 0.0132649 0.0454589 0.1409206 0.0427687 0.035451 -0.0078689 -0.0017818 -0.0449201 0.0324689 -0.0446002 0.0579391 0.1166068 -0.0183205 0.0302807 0.0159547 0.0214957 0.0690594 0.0428601 0.0162852 -0.003537 0.087302 0.014457 -0.0006063 0.0222045 0.0112718 0.1011605 -0.0022473 0.002197 0.0251476 0.1573051 -0.0385461 0.0258292 0.0443632 -0.0006654 0.0411691 -0.0239585 0.0236108 -0.0074402 0.0562056 0.0078218 0.059318 -0.0911881 0.0364969 -0.0951069 0.1009077 -0.0848093 0.0755623 -0.0254687 -0.0570881 -0.0665029 0.0770482 -0.0668526 -0.1064289 0.082874 0.0732334 0.0724147 0.0433433 0.0237556 -0.0029189 0.0014447 -0.0250467 0.001673 -0.0849433 -0.0141926 -0.0573071 -0.1744436 -0.1436742 -0.003997 0.100095 0.0039531 0.0365085 0.0037699 0.1491353 0.0030965 0.0218136 0.0578298 -0.0057462 -0.0356824 0.0164564 0.0309622 -0.0196353 -0.1171746 -0.0150759 -0.1074569 0.0477582 0.02762 -0.0002452 0.0288761 0.0720064 -0.0821862 0.0124703 -0.0179049 -0.1274669 -0.0323166 -0.13068 0.000296 -0.1175098 -0.1377048 0.015146 -0.0096784 -0.0086275 0.0769333 0.0377602 -0.0374708 -0.0215155 -0.0274589 0.0481486 -0.0332068 0.0248697 -0.0956431 -0.1802709 -0.0269129 0.1054733 -0.0467567 0.1079196 -0.1249777 0.0729539 -0.0617437 0.1056007 0.0378021 0.0840219 -0.0150927 -0.0507506 0.0148793 0.0683493 -0.0716763 0.0223213 -0.0740056 -0.0995532 -0.0273598 -0.0960893 0.0144923 -0.1586445 -0.1051071 0.0117858 0.0293874 0.0072726 0.0909163 -0.0139588 0.0888092 -0.0417125 0.133521 -0.0296644 0.0955145 -0.090042 0.1044156 0.0003117 unknown
polarizability: 84.5385209|-0.5586982|70.8323724|0.6488011|-0.8822356|62.5141937 unknown
InChI: InChI=1S/C7H12O/c1-5-3-2-4-6-7(5)8-6/h5-7H,2-4H2,1H3
charge 0 multiplicity 1
20 atoms
O  -0.190982 -1.528193 -0.793965
C  0.326844 -0.980103 0.522253
C  -1.15357 -1.008213 0.266609
C  1.125724 0.315162 0.432286
C  -1.918686 0.260547 -0.098714
C  0.362271 1.391192 -0.3822
C  -1.089676 1.552129 0.120331
C  2.533721 0.043147 -0.146409
H  0.758769 -1.761481 1.165814
H  -1.737713 -1.818854 0.723751
H  1.234288 0.6897 1.47489
H  -2.85076 0.305633 0.496967
H  -2.221403 0.179727 -1.160928
H  0.356709 1.098034 -1.450411
H  0.904605 2.353218 -0.306208
H  -1.070125 1.798235 1.201847
H  -1.585288 2.399311 -0.390836
H  2.451627 -0.374964 -1.166031
H  3.123693 0.976567 -0.201633
H  3.096853 -0.678894 0.473984
