program: Gaussian 09
title: 000019068
version: EM64L-G09RevD.01
frameworkgroup: C1[X(C9H14N4)]
method: RPBEPBE
basis: SDD
operation: Freq
keyword: #pfreq=noraman
keyword: PBEPBE/SDD
title: #p freq=noraman PBEPBE/SDD
converged: YES YES NO NO
title: Mulliken charges:
elementType: N N N N C C C C C C C C C H H H H H H H H H H H H H H
charge: -0.142904 -0.392476 -0.669654 -0.527385 0.404289 -0.540017 0.439697 -0.381893 -0.400029 -0.400231 -0.380867 -0.811383 0.227653 0.217572 0.202721 0.217848 0.268863 0.223725 0.223031 0.222988 0.220601 0.232511 0.299661 0.314586 0.335927 0.304008 0.291159
chargesum: 0.00000
title: Mulliken charges with hydrogens summed into heavy atoms:
elementType: N N N N C C C C C C C C C
charge: -0.142904 -0.092815 -0.019142 0.067782 0.404289 -0.119724 0.439697 -0.164045 -0.131166 -0.176506 -0.157836 -0.135283 0.227653
polarizability: 1.83513243e+02 -5.33717945e+00 1.31945215e+02 -3.53634209e+00 -2.13446195e+00 6.66366815e+01
1716.lowfreq: -12.8116 -7.0437 -0.0004 -0.0002 0.0007 4.8262 9.7730 21.5953 35.0521
frequency: -6.4555 21.0830 35.0375 70.2860 127.0976 158.7696 180.6098 212.8427 219.3058 267.5854 296.0652 322.1856 378.0867 388.8125 407.9414 410.4888 464.4835 487.8267 532.4644 567.7016 635.6420 656.3286 667.6948 712.6651 747.3251 802.4499 815.5132 830.6939 857.0248 905.3087 940.2975 978.3749 984.5007 1000.3996 1012.0300 1015.0204 1046.5822 1111.3838 1128.7946 1178.9483 1198.6591 1212.1470 1220.0172 1223.6527 1289.2749 1295.9342 1327.3659 1343.5870 1381.7982 1395.7905 1403.7717 1435.3262 1447.4257 1472.3601 1473.5644 1508.2739 1586.1573 1610.9608 1627.7512 1663.2479 1691.0466 2862.9450 2908.7424 2971.0652 3051.4942 3080.1832 3097.4897 3114.2452 3127.5005 3165.8061 3359.8156 3485.1738 3514.4893 3548.8872 3694.5853
redmass: 1.0232 3.8053 3.7762 4.4216 3.3648 3.3410 2.8971 1.5526 3.5275 1.8824 3.1589 2.6919 2.0219 1.3429 2.7977 1.4288 3.2241 2.4701 4.7931 1.6105 5.6984 6.0965 3.1194 3.1007 3.5336 1.3204 2.1612 3.3270 1.2530 4.0734 1.3444 1.5150 1.4088 1.6248 2.3833 1.9861 1.5554 1.3979 3.0913 1.1631 2.9739 2.5928 2.7483 1.1158 1.3768 1.2438 1.6113 2.1216 3.7183 1.2275 3.0410 1.6098 1.1301 1.0688 1.0765 2.7445 5.8742 1.2125 6.4396 4.2275 1.1267 1.0592 1.0959 1.0385 1.0950 1.0996 1.0870 1.0898 1.0959 1.0933 1.0450 1.0951 1.0771 1.0453 1.1031
irintensity: 0.5551 2.2225 0.9762 0.6619 1.5010 6.0299 12.5071 3.0404 2.6907 8.2779 0.1533 3.6928 6.5770 300.9442 1.5664 56.4075 13.2063 25.2098 11.7141 242.0419 9.8731 1.7589 55.4650 0.4197 3.3814 44.4972 137.8050 44.1407 3.6044 17.3334 0.1791 0.2469 0.0919 3.5554 18.7943 4.7852 18.8974 19.1553 4.2568 7.5016 35.8994 8.0683 0.1264 4.6421 21.3421 9.9462 39.3371 65.6646 27.4084 8.0096 2.7947 128.4369 32.6002 14.5637 15.7473 44.7244 14.5376 97.3209 1.8793 568.3747 3.2583 56.9436 44.9455 45.4369 26.2985 20.1320 17.4042 26.8778 29.9420 5.5197 4.7318 4.5115 12.7513 23.8119 18.4635
temp: 298.150 k
press: 1.00000 atm
elementType: 7 7 7 7 6 6 6 6 6 6 6 6 6 1 1 1 1 1 1 1 1 1 1 1 1 1 1
symmnumber: 1
zpe: 588360.5 jmol-1
zpe.correction: 0.224095 hartree
zpe.thermalcorrener: 0.237297 hartree
zpe.thermalcorrenthalpy: 0.238241 hartree
zpe.thermalcorrgfe: 0.183159 hartree
zpe.sumelectzpe: -569.348477 hartree
zpe.sumelectthermal: -569.335276 hartree
zpe.sumelectthermalent: -569.334331 hartree
zpe.sumelectthermalfe: -569.389413 hartree
dipole: 1.5252 -2.7129 -0.7734
dipole: 3.2069
quadrupole: -64.3222 -69.4039 -81.9510
quadrupole: -11.8267 -3.1196 -1.1932
quadrupole: 7.5702 2.4884 -10.0586 -11.8267 -3.1196 -1.1932
hfenergy: -569.5725721 hartree
pointgroup: C01[X(C9H14N4)]
dipole: -0.5708132 -1.0617838 -0.3723656 debye
polarizability: 182.3489245|11.752371|106.8332146|-5.9426831|31.4168164|92.9130008 unknown
InChI: InChI=1S/C9H14N4/c1-7-2-4-8(5-3-7)6-12-9(10)13-11/h2-5,13H,6,10-11H2,1H3
charge 0 multiplicity 1
27 atoms
N  -1.876902 0.034078 -0.12232
N  -4.046998 0.407299 0.720717
N  -3.697244 -1.523475 -0.563569
N  -3.604237 1.612099 1.345601
C  0.54826 -0.385827 -0.493347
C  -0.886465 -0.832653 -0.778995
C  3.257528 0.399199 0.033736
C  1.632306 -1.049684 -1.119652
C  0.832295 0.673281 0.398227
C  2.965126 -0.664976 -0.858599
C  2.167378 1.056672 0.658206
C  4.690401 0.836555 0.290741
C  -3.118601 -0.36962 -0.015941
H  -1.029656 -0.82909 -1.885386
H  -0.989038 -1.899047 -0.457872
H  1.436292 -1.877459 -1.815005
H  -0.011122 1.181165 0.874465
H  3.789403 -1.195214 -1.352219
H  2.36689 1.879519 1.356843
H  4.822285 1.203475 1.324406
H  5.402668 0.007866 0.129371
H  4.985013 1.660299 -0.388854
H  -4.988563 0.485319 0.327943
H  -4.535098 -1.925169 -0.148222
H  -3.183831 -2.075487 -1.24413
H  -2.833461 2.018525 0.788209
H  -3.271632 1.40155 2.296846
