program: Gaussian 09
title: 000224194
version: EM64L-G09RevD.01
frameworkgroup: C1[X(C10H10ClNS2)]
method: RPBEPBE
basis: SDD
operation: Freq
keyword: #p
keyword: freq=noraman
keyword: PBEPBE/SDD
title: #p freq=noraman PBEPBE/SDD
converged: NO YES NO NO
title: Mulliken charges:
elementType: Cl S S N C C C C C C C C C C H H H H H H H H H H
charge: -0.052289 0.183191 0.291926 0.019814 -0.804648 0.494196 -0.602252 -0.359359 -0.360515 -0.604123 -0.205543 -0.205574 -0.100043 -0.353451 0.268654 0.267744 0.265788 0.265852 0.242790 0.242819 0.294032 0.293980 0.258489 0.258520
chargesum: 0.00000
title: Mulliken charges with hydrogens summed into heavy atoms:
elementType: Cl S S N C C C C C C C C C C
charge: -0.052289 0.183191 0.291926 0.019814 -0.268251 0.494196 -0.070613 -0.116569 -0.117696 -0.016110 0.052946 0.052947 -0.100043 -0.353451
polarizability: 2.84445340e+02 3.81088768e+00 1.06635342e+02 -2.22217751e-01 2.20827566e-01 1.12279212e+02
1716.lowfreq: -12.1245 -0.0020 0.0012 0.0013 3.3011 5.3788 14.2380 22.8368 28.7996
frequency: 10.1943 18.8983 28.7638 32.9295 44.6512 71.9267 93.8333 109.2811 137.8153 233.7407 235.7311 262.2056 320.3608 351.7282 380.9637 386.0010 406.6483 436.2571 494.8325 625.6883 626.2543 626.3585 633.6049 646.7258 720.8530 742.0670 783.0850 802.0990 828.6706 841.2770 892.4687 952.1219 953.2137 965.6206 1000.4167 1055.6025 1071.4048 1089.6780 1109.4023 1133.7913 1184.2467 1214.8562 1222.2062 1252.1289 1266.4623 1296.1108 1298.7050 1380.3087 1396.0919 1455.6229 1457.6879 1464.0361 1477.7950 1587.2790 1600.6679 2098.4484 3013.9843 3019.0532 3055.0121 3084.4037 3092.4265 3136.7292 3138.9032 3142.7211 3172.6914 3175.7589
redmass: 8.0569 6.1698 12.4608 5.9912 2.1194 10.2730 4.0277 11.8894 9.6624 4.6460 8.1617 6.2476 7.7702 2.7159 12.6097 9.0048 2.8694 9.0133 3.3972 6.4467 9.5809 6.9539 11.6910 5.5942 3.7196 4.7089 1.1097 4.0792 1.2473 1.7621 1.4523 1.3570 1.3244 1.3749 4.2348 4.4526 2.7665 1.2683 1.0558 1.0939 1.1180 1.1804 2.6445 1.2409 1.1850 1.2691 1.2289 7.5706 2.8061 1.0939 1.1026 1.1039 2.4991 7.3891 6.3113 12.7198 1.0557 1.0567 1.0560 1.1092 1.1091 1.0901 1.0901 1.1114 1.0952 1.0963
irintensity: 0.1517 0.0890 1.2567 1.1286 0.9453 1.4694 4.4221 2.4325 0.7821 0.0660 1.4978 4.7170 0.2205 0.7289 0.2624 15.9011 0.0006 5.3230 19.7021 13.7119 16.2422 0.3432 0.5268 33.5787 5.2804 19.0725 8.8714 16.6454 0.0321 47.2186 1.3388 0.0213 0.0407 0.0055 43.4670 7.3223 47.3334 4.3841 2.5661 4.5883 1.0130 17.1206 9.9690 7.1989 0.1268 0.1520 11.0315 0.3522 5.5359 5.3711 10.3699 4.4149 77.0960 1.1481 23.5076 33.3720 28.7269 12.8526 3.9532 15.5973 3.7883 7.7129 8.6155 7.0135 5.6351 0.4269
temp: 298.150 k
press: 1.00000 atm
elementType: 17 16 16 7 6 6 6 6 6 6 6 6 6 6 1 1 1 1 1 1 1 1 1 1
symmnumber: 1
zpe: 453632.9 jmol-1
zpe.correction: 0.172780 hartree
zpe.thermalcorrener: 0.188363 hartree
zpe.thermalcorrenthalpy: 0.189307 hartree
zpe.thermalcorrgfe: 0.123692 hartree
zpe.sumelectzpe: -1696.939318 hartree
zpe.sumelectthermal: -1696.923735 hartree
zpe.sumelectthermalent: -1696.922791 hartree
zpe.sumelectthermalfe: -1696.988406 hartree
dipole: 2.6416 -3.5814 0.1553
dipole: 4.4529
quadrupole: -156.7224 -108.4289 -96.8189
quadrupole: 11.9594 -0.7009 0.5880
quadrupole: -36.0657 12.2278 23.8379 11.9594 -0.7009 0.5880
hfenergy: -1697.1120981 hartree
pointgroup: C01 [X(C10H10Cl1N1S2)]
dipole: 1.1055009 -1.0532878 -0.8588703 debye
dipolederiv: -0.8744009 -0.1940686 -0.163571 -0.2385426 -0.1496867 -0.0208261 -0.2013717 -0.0208879 -0.1451559 -0.4456184 0.0396213 0.0321874 0.1767167 -0.0764004 0.0687302 0.1422037 0.0707194 -0.1103465 -0.394475 0.1120741 0.0903225 0.1525374 0.1116314 0.0533396 0.12319 0.0534894 0.0832972 -0.3827284 0.0560018 0.0443112 0.1688265 -0.2308724 -0.0282824 0.133639 -0.0282938 -0.2179444 0.5028911 -0.0900494 -0.0723299 -0.252101 0.175577 0.0297002 -0.2023116 0.027522 0.1685101 0.0911246 0.0199259 0.0172721 0.1086532 -0.0772232 -0.0184959 0.090146 -0.017616 -0.0712479 0.047937 0.0960336 0.0758153 0.0792489 0.0953474 -0.0452716 0.0638598 -0.0475602 0.1155271 0.0243081 0.0862908 0.0001037 -0.0001634 -0.0357047 -0.0976997 0.0859933 -0.0833226 -0.0063785 0.0241533 0.0184614 0.0841912 0.0870144 -0.0450674 -0.0821339 -0.018026 -0.0963493 0.0046698 0.7172151 0.1122284 0.0838052 0.0224521 0.042856 -0.0763772 0.0097659 -0.0766837 0.0787339 -0.3631889 -0.1056789 0.0185993 -0.1630667 -0.1066398 -0.0480768 0.0297494 -0.056121 -0.0189811 -0.3606735 -0.0001071 -0.1104555 -0.0011002 -0.044093 -0.067663 -0.1716321 -0.0604595 -0.0846307 1.2024387 0.3378911 0.2834483 0.3799122 0.1139489 -0.0125984 0.3204036 -0.012511 0.1265186 0.14274 -0.2213607 -0.1735191 -0.337937 0.006349 0.0338247 -0.2648609 0.0339778 -0.0069937 -0.0466523 0.0115052 -0.0072721 0.0766895 0.0540697 0.0049356 0.0110874 -0.0390173 -0.1186237 -0.0472988 -0.0079759 0.0122935 0.0241046 -0.1174311 -0.0038003 0.0718564 0.0414341 0.0533751 -0.0081637 -0.0290997 -0.023014 -0.044105 -0.1148614 0.02522 -0.0186042 0.0254592 0.0644608 -0.0083177 -0.0302752 -0.0251325 -0.0292138 0.0658781 -0.0170627 -0.0398117 -0.0169593 -0.115669 0.0463736 -0.0952866 0.035762 -0.0844959 0.0363776 0.081147 0.0408295 0.0738729 0.061717 0.0488547 0.0148988 -0.0996278 0.0219386 0.0922107 0.0631002 -0.0899321 0.0704948 0.0033246 -0.0162585 -0.0392073 -0.0252919 -0.0199783 -0.0531567 0.0255648 -0.0493689 0.0161015 0.0726617 -0.0162122 -0.0345749 -0.0330294 -0.0541206 0.0743553 -0.0142473 -0.0088258 -0.0045995 -0.05561 0.0589438 0.010999 -0.0710375 0.0032118 0.1130971 0.0674596 -0.0777685 0.0711694 0.0365987 0.0570082 -0.0682469 0.0261689 -0.0764811 0.0694387 0.0795135 0.0197896 0.0761405 0.0821866 unknown
polarizability: 283.6744018|9.6535847|109.3837089|7.6073276|-2.4020091|110.301783 unknown
InChI: InChI=1S/C10H10ClNS2/c11-10-3-1-9(2-4-10)7-13-5-6-14-8-12/h1-4H,5-7H2
charge 0 multiplicity 1
24 atoms
Cl 6.162056 0.838866 0.707702
S  -0.818548 0.245324 0.169393
S  -5.20545 -0.674896 -0.507992
N  -7.237564 0.991712 0.814382
C  0.436654 -0.882482 -0.746279
C  1.842656 -0.463835 -0.393563
C  -2.409025 -0.579297 -0.466684
C  2.504023 -1.026614 0.728452
C  2.523903 0.510132 -1.168354
C  -3.594531 0.171071 0.140693
C  3.817272 -0.637352 1.071395
C  3.837322 0.913217 -0.841523
C  4.463246 0.329251 0.276614
C  -6.387301 0.329288 0.286396
H  0.235903 -0.777332 -1.825463
H  0.225811 -1.917417 -0.428933
H  -2.40036 -1.637623 -0.152906
H  -2.417296 -0.516363 -1.568669
H  1.98995 -1.77367 1.343906
H  2.025891 0.96162 -2.03403
H  -3.630547 1.22268 -0.181688
H  -3.613216 0.100862 1.238823
H  4.325628 -1.074935 1.935103
H  4.360725 1.662294 -1.442273
