program: Gaussian 09
title: 000224201
version: EM64L-G09RevD.01
frameworkgroup: C1[X(C12H14Cl4O2)]
method: RPBEPBE
basis: SDD
operation: Freq
keyword: #p
keyword: freq=noraman
keyword: PBEPBE/SDD
title: #p freq=noraman PBEPBE/SDD
converged: YES YES NO NO
title: Mulliken charges:
elementType: Cl Cl Cl Cl O O C C C C C C C C C C C C H H H H H H H H H H H H H H
charge: -0.049565 -0.049578 -0.071167 -0.071148 -0.264409 -0.264406 0.616383 0.616355 -0.430970 -0.430925 -0.343794 -0.343846 -0.361019 -0.360960 -0.231554 -0.231579 -0.563938 -0.563920 0.214557 0.210605 0.214556 0.210581 0.267832 0.267843 0.248297 0.208723 0.248303 0.208704 0.266326 0.283704 0.266298 0.283710
chargesum: 0.00000
title: Mulliken charges with hydrogens summed into heavy atoms:
elementType: Cl Cl Cl Cl O O C C C C C C C C C C C C
charge: -0.049565 -0.049578 -0.071167 -0.071148 -0.264409 -0.264406 0.616383 0.616355 -0.005808 -0.005788 -0.343794 -0.343846 -0.093187 -0.093117 0.225466 0.225428 -0.013908 -0.013912
polarizability: 2.87630827e+02 -1.31465234e+01 1.59727489e+02 -5.41094975e-03 5.78029185e-03 1.03357610e+02
1716.lowfreq: -4.3699 0.0014 0.0017 0.0017 2.9089 11.6732 13.1663 15.2093 24.9439
frequency: 11.6729 14.8614 24.7123 27.9602 43.8725 61.5257 66.3387 83.5442 94.0189 112.9649 127.1997 188.8109 192.0939 221.6783 240.6138 245.0934 254.3259 276.9234 280.6091 309.0924 309.7939 380.5288 381.8356 449.9102 450.1548 480.0045 526.4989 550.6157 656.8426 675.7858 678.9243 701.8787 708.1247 785.6482 785.6835 807.4561 853.5736 855.1632 891.9290 903.9273 933.7556 965.0487 985.3414 1003.5355 1014.5802 1022.8169 1023.6577 1050.2877 1056.3090 1056.3620 1172.9202 1178.0533 1185.6308 1195.0987 1202.7302 1247.1394 1253.0703 1253.5412 1261.1621 1270.2006 1270.5101 1348.7162 1352.2213 1357.3766 1376.5342 1377.2940 1379.1894 1457.5026 1457.5287 1470.1354 1470.1630 1477.6814 1479.9911 1480.6878 1556.2274 1613.3471 2960.7873 2961.1154 2988.3289 2988.4358 3021.1649 3021.2451 3070.2231 3070.2892 3087.5423 3087.5812 3158.8654 3158.9143 3161.5668 3163.9832
redmass: 11.6499 8.6571 8.7700 11.9946 3.6329 4.6090 6.4776 5.7172 3.3045 4.6831 5.5928 6.4554 7.3043 5.6276 4.5603 3.5680 5.6985 3.6298 3.5830 3.0280 25.5123 7.6902 5.3053 3.0411 7.7012 3.0566 7.3539 5.2491 8.7260 6.3046 6.3344 4.0815 6.9545 1.1597 1.1591 3.4958 2.8147 3.0776 1.9561 1.7966 5.7333 1.9165 2.2973 4.0514 2.2625 1.3542 1.5102 3.3277 4.3691 4.3363 1.4341 1.3235 1.3785 1.0986 1.3364 3.5934 1.1592 1.2393 1.2152 1.1362 1.1488 1.3819 1.2124 2.0194 1.3326 5.0648 1.7526 1.0958 1.0962 1.0833 1.0834 3.1601 1.0935 1.1682 7.5444 8.7079 1.0577 1.0578 1.0647 1.0647 1.1047 1.1046 1.0579 1.0579 1.0998 1.0998 1.1117 1.1117 1.0924 1.0933
irintensity: 0.1407 0.1066 0.0943 0.0249 0.0002 0.1417 5.5182 0.5987 1.4396 0.7017 0.3001 0.0194 1.7980 23.0590 0.9439 0.6160 3.1634 19.0737 2.7904 0.5855 0.0016 0.4322 2.8289 7.9259 5.4972 0.6538 36.7593 2.0506 0.0154 166.2044 3.3785 9.0919 1.3596 4.3869 15.8254 18.0334 0.7411 39.4324 5.0971 13.9034 0.1059 78.6467 25.8559 188.8574 23.2578 10.1238 23.3354 108.1968 21.8798 45.2457 9.7317 4.0780 8.3173 0.6477 26.4997 0.0396 22.0093 0.8257 0.1865 3.3168 2.3128 11.0231 3.9166 34.8120 0.4328 3.5913 92.4978 0.0248 6.9406 2.9035 19.6185 25.5111 2.9932 4.5392 0.0258 0.0184 15.3313 76.1685 82.9370 13.4087 0.8741 32.1626 13.7528 11.3277 8.3623 20.0668 7.1666 19.8797 0.9621 0.0659
temp: 298.150 k
press: 1.00000 atm
elementType: 17 17 17 17 8 8 6 6 6 6 6 6 6 6 6 6 6 6 1 1 1 1 1 1 1 1 1 1 1 1 1 1
symmnumber: 1
zpe: 621272.1 jmol-1
zpe.correction: 0.236630 hartree
zpe.thermalcorrener: 0.256808 hartree
zpe.thermalcorrenthalpy: 0.257752 hartree
zpe.thermalcorrgfe: 0.181354 hartree
zpe.sumelectzpe: -2454.953513 hartree
zpe.sumelectthermal: -2454.933335 hartree
zpe.sumelectthermalent: -2454.932391 hartree
zpe.sumelectthermalfe: -2455.008789 hartree
dipole: -0.0004 0.0016 -3.0403
dipole: 3.0403
quadrupole: -169.4549 -129.6225 -134.4258
quadrupole: 9.9828 0.0068 0.0012
quadrupole: -24.9539 14.8786 10.0753 9.9828 0.0068 0.0012
hfenergy: -2455.1901429 hartree
pointgroup: C01 [X(C12H14Cl4O2)]
dipole: -0.0006726 -1.196159 -0.0035036 debye
polarizability: 284.405796|-0.1962415|103.3584626|23.9768246|-0.216154|162.9516669 unknown
InChI: InChI=1S/C12H14Cl4O2/c13-1-3-17-7-9-5-12(16)10(6-11(9)15)8-18-4-2-14/h5-6H,1-4,7-8H2
charge 0 multiplicity 1
32 atoms
Cl -2.148267 -0.781329 -2.393131
Cl 2.147166 -0.800241 2.388131
Cl -7.125557 1.165896 -0.631297
Cl 7.127011 1.152715 0.638641
O  -3.287821 0.639189 0.797899
O  3.288711 0.639726 -0.794151
C  -1.405027 -0.796362 0.323118
C  1.403969 -0.796185 -0.328184
C  -2.867348 -0.779149 0.70062
C  2.866348 -0.778599 -0.70545
C  -0.948946 -0.788683 -1.015927
C  0.94788 -0.796702 1.010887
C  -0.41804 -0.800134 1.339828
C  0.41698 -0.79188 -1.344893
C  -4.752853 0.811847 0.803262
C  4.753949 0.810579 -0.79818
C  -5.24235 0.967006 -0.640866
C  5.243648 0.955271 0.646984
H  -3.020248 -1.269849 1.683756
H  -3.469401 -1.311602 -0.061911
H  3.018739 -1.263548 -1.691514
H  3.46755 -1.316382 0.054008
H  -0.730692 -0.796079 2.388248
H  0.729639 -0.781305 -2.393268
H  -4.94494 1.73316 1.377326
H  -5.263461 -0.035092 1.304697
H  4.947162 1.735589 -1.365881
H  5.26355 -0.033514 -1.305414
H  -5.031577 0.084334 -1.261978
H  -4.843443 1.874888 -1.113537
H  5.032283 0.068472 1.262007
H  4.845485 1.860163 1.12597
