program: Gaussian 09
title: 000224193
version: EM64L-G09RevD.01
frameworkgroup: C1[X(C9H9BrClNO3)]
method: RPBEPBE
basis: SDD
operation: Freq
keyword: #p
keyword: freq=noraman
keyword: PBEPBE/SDD
title: #p freq=noraman PBEPBE/SDD
converged: YES YES NO NO
title: Mulliken charges:
elementType: Br Cl O O O N C C C C C C C C C H H H H H H H H H
charge: -0.005433 -0.076390 -0.228855 -0.211449 -0.175068 0.008819 0.285594 0.569507 0.253661 -0.485356 -0.305479 -0.367656 -0.287664 -0.772431 -0.621961 0.289566 0.256126 0.247478 0.256627 0.235775 0.269425 0.274752 0.277785 0.312629
chargesum: 0.00000
title: Mulliken charges with hydrogens summed into heavy atoms:
elementType: Br Cl O O O N C C C C C C C C C
charge: -0.005433 -0.076390 -0.228855 -0.211449 -0.175068 0.008819 0.285594 0.569507 0.253661 -0.195790 -0.049353 -0.120178 0.204738 -0.228254 -0.031548
polarizability: 1.85675191e+02 -1.81672271e+01 1.64537614e+02 -6.85290822e+00 -3.34317882e+00 9.34201368e+01
1716.lowfreq: -8.3084 -6.4758 -0.0004 0.0001 0.0017 7.6827 17.6934 27.8773 36.9713
frequency: 16.3442 27.8550 36.1533 43.0329 73.4087 93.3698 122.6245 142.8468 191.5033 198.0657 267.8585 328.5272 336.3489 350.2745 375.9815 419.7970 442.7599 481.1077 530.7338 540.3714 573.5872 629.8299 658.2281 687.4539 716.1029 738.6148 752.5851 825.4012 842.6695 892.8418 919.1448 932.6865 939.2400 960.4374 972.7060 1058.0775 1070.1649 1117.9880 1158.9091 1174.8885 1201.1184 1215.9482 1229.7326 1243.7480 1247.8293 1282.5230 1295.0782 1358.6754 1363.7340 1382.3175 1420.2430 1423.3723 1460.2672 1466.8658 1495.4524 1570.6129 1620.5768 3000.7216 3058.4322 3067.7360 3073.7537 3141.8663 3148.7292 3148.9987 3167.3165 3176.9135
redmass: 12.6356 10.8959 7.8671 15.6723 9.0296 5.0297 5.7630 5.5001 6.7433 4.8059 2.9032 3.2108 8.2962 5.2376 5.7505 3.5074 3.3918 4.3841 3.8737 5.4086 5.6574 5.2562 7.2880 5.0340 4.6062 4.8465 8.5764 1.4704 2.1680 2.0667 1.7617 1.9612 2.7497 1.3597 1.9763 2.6905 2.7260 1.1242 1.2862 1.3100 4.9162 1.4431 2.0444 1.4962 1.5519 1.6876 1.3376 1.4630 4.5846 5.3598 4.5825 1.1086 1.1235 1.0902 3.0241 7.4459 6.8049 1.0597 1.0613 1.0579 1.1003 1.0906 1.1110 1.1092 1.0923 1.0943
irintensity: 0.2852 1.9780 1.4425 1.1950 2.4045 3.4819 1.4050 1.0803 2.4134 5.2191 1.7714 2.9147 3.9622 1.5128 1.0928 6.7333 6.1819 11.4193 16.1648 51.9541 13.0402 54.0953 10.3388 10.0595 2.8288 7.1488 16.2022 31.2850 1.4370 13.9955 5.5471 21.9434 44.7461 0.4350 35.3955 1.0337 45.0433 1.0545 4.8924 39.3455 256.1046 50.8395 48.6298 142.8776 66.5169 8.1259 82.1700 28.8244 68.6465 35.7128 12.1882 14.5163 7.0598 13.3082 143.9655 24.3277 98.8641 30.8346 14.3547 19.1174 11.5900 4.8999 4.0123 3.4840 1.4851 4.6843
temp: 298.150 k
press: 1.00000 atm
elementType: 35 17 8 8 8 7 6 6 6 6 6 6 6 6 6 1 1 1 1 1 1 1 1 1
symmnumber: 1
zpe: 442038.6 jmol-1
zpe.correction: 0.168364 hartree
zpe.thermalcorrener: 0.183403 hartree
zpe.thermalcorrenthalpy: 0.184347 hartree
zpe.thermalcorrgfe: 0.121311 hartree
zpe.sumelectzpe: -1101.084250 hartree
zpe.sumelectthermal: -1101.069211 hartree
zpe.sumelectthermalent: -1101.068267 hartree
zpe.sumelectthermalfe: -1101.131303 hartree
dipole: -2.9247 -2.1731 5.4309
dipole: 6.5399
quadrupole: -95.4767 -122.6317 -101.2547
quadrupole: -6.6033 0.1340 0.2405
quadrupole: 10.9777 -16.1773 5.1996 -6.6033 0.1340 0.2405
hfenergy: -1101.2526141 hartree
pointgroup: C01 [X(C9H9Br1Cl1N1O3)]
dipole: 0.5672969 2.2190206 1.1723543 debye
dipolederiv: -0.1806274 0.0348543 -0.10379 -0.0057134 -0.1846291 0.1478594 0.0623041 0.1327819 -0.3935145 -0.5758476 0.0088921 -0.163553 -0.0526196 -0.1633906 -0.0385315 -0.5960634 -0.0108617 -0.545752 -1.8724485 -0.6349193 0.0301834 -0.3121344 -0.3014222 0.0338023 -0.0868079 -0.0667558 -0.2505397 -0.4744815 -0.1016054 0.175063 -0.094174 -0.7859156 0.2717972 0.1695281 0.2146025 -0.4006909 -0.654218 0.2019836 0.1644683 0.2231451 -0.5031517 0.0450549 0.1396254 0.0954124 -0.3087368 0.9355928 -0.3526168 -0.3479216 -0.2497658 1.5250135 -0.453843 -0.3109472 -0.4071791 0.5069722 1.6272908 0.5935481 -0.0151177 -0.2409737 0.1420757 -0.0251015 0.1927949 -0.0461627 0.1403808 -0.2902022 -0.003195 -0.0261401 0.0026461 -0.3862314 0.0663674 0.1543641 0.0554535 -0.117115 -0.3598384 0.2791355 -0.0371916 -0.0789543 -0.540307 0.1167325 -0.0274982 0.1027795 -0.0182955 0.1482895 -0.3418422 0.097047 -0.0667114 0.1376236 -0.06816 -0.0154815 0.0369465 -0.0887553 -0.5285149 -0.0714195 -0.0381766 0.4390282 0.0355895 -0.0121309 -0.1019574 -0.0571075 -0.1435858 0.287068 0.1748669 0.001145 0.0647542 0.225047 -0.0338782 0.0379552 -0.0680013 -0.0928318 0.861406 0.4121207 -0.1649959 0.6053979 0.4764713 0.0382271 0.032092 0.0915082 0.1247343 0.8497032 -0.0157617 0.2872596 0.028969 0.1458782 0.0564879 0.5310749 0.0261783 0.6867483 0.0568533 -0.1461125 0.2575113 -0.1059042 0.1497769 -0.2623158 0.0874344 -0.2522546 0.5333138 0.0875479 -0.0344974 0.002522 -0.0526484 0.0679925 0.0020756 0.028842 -0.003878 0.1526399 0.0505221 -0.0654983 -0.0171845 -0.0774841 0.0033661 0.0303017 -0.0132152 0.0305293 0.1501404 0.0516072 0.0757007 -0.008756 0.0697744 -0.0153526 0.0333405 -0.0251596 0.0299088 0.1306434 -0.0880368 -0.0857663 -0.0085455 -0.0445952 0.0584034 0.08492 -0.0973015 0.0363486 -0.0591138 -0.0290436 0.0681643 0.0824619 -0.0449538 -0.0785006 -0.0559072 0.0115459 -0.0238287 0.0950126 0.0157778 0.0148913 -0.0324874 0.0882939 -0.0341695 -0.0743987 -0.0633161 -0.0451624 -0.0250421 0.0233058 -0.0113663 -0.0288352 -0.0988672 0.0103492 0.0662459 -0.0238879 0.0486957 -0.0498531 -0.0531747 -0.0736644 -0.0710984 -0.0867648 0.0270781 0.0292011 -0.0635419 0.0210533 -0.0146152 0.1114694 0.0741077 -0.0338676 0.0902553 -0.0115947 0.0018535 -0.0223832 0.0589932 -0.0121443 unknown
polarizability: 193.4796269|2.1477361|141.692772|15.4297828|-25.4098463|108.4605425 unknown
InChI: InChI=1S/C9H9BrClNO3/c10-3-4-15-9-2-1-7(6-11)5-8(9)12(13)14/h1-2,5H,3-4,6H2
charge 0 multiplicity 1
24 atoms
Br 2.772181 2.478046 -2.080407
Cl -4.42846 0.26627 -1.783869
O  1.89319 0.203141 0.468418
O  -0.390323 -3.042896 1.379876
O  1.512764 -2.440067 0.277201
N  0.33378 -2.187392 0.727251
C  0.520238 0.322395 0.319812
C  -2.344601 0.405244 0.133427
C  -0.269704 -0.860087 0.469914
C  -1.676264 -0.810189 0.388851
C  -0.15912 1.541237 0.05504
C  -1.560059 1.576463 -0.040398
C  2.761597 1.376969 0.681895
C  -3.837428 0.452841 0.036621
C  3.689633 1.592696 -0.506933
H  -2.230531 -1.743042 0.529909
H  0.410124 2.457859 -0.117479
H  -2.054834 2.527515 -0.267396
H  3.385782 1.092537 1.55109
H  2.187501 2.282444 0.944746
H  -4.26081 1.418563 0.346712
H  -4.331861 -0.376638 0.560746
H  4.519733 2.265656 -0.239719
H  4.068777 0.634135 -0.890104
