program: Gaussian 09
title: 000224190
version: EM64L-G09RevD.01
frameworkgroup: C1[X(C7H12Cl2S)]
method: RPBEPBE
basis: SDD
operation: Freq
keyword: #p
keyword: freq=noraman
keyword: PBEPBE/SDD
title: #p freq=noraman PBEPBE/SDD
converged: YES YES NO NO
title: Mulliken charges:
elementType: Cl Cl S C C C C C C C H H H H H H H H H H H H
charge: -0.004122 0.006629 0.271744 -0.338396 -0.325729 -0.350923 -0.666177 -0.690377 -0.253780 -0.328118 0.190380 0.192225 0.209729 0.214815 0.196277 0.198184 0.276927 0.270135 0.211334 0.210394 0.219269 0.289578
chargesum: 0.00000
title: Mulliken charges with hydrogens summed into heavy atoms:
elementType: Cl Cl S C C C C C C C
charge: -0.004122 0.006629 0.271744 0.044208 0.098815 0.043539 -0.119115 -0.049380 -0.253780 -0.038539
polarizability: 1.77369376e+02 -1.60299801e-01 1.00067891e+02 -1.12763724e+01 -2.04400399e-01 7.84322612e+01
1716.lowfreq: -22.6148 -5.2393 -0.0033 -0.0026 -0.0023 5.2397 11.9321 24.1955 44.1896
frequency: -13.8148 23.5706 44.1350 70.1530 97.7351 121.3373 134.7367 155.4760 203.6881 222.1844 226.4319 259.4302 350.0447 368.4016 430.2920 476.3772 537.6757 674.6982 728.3706 743.3975 754.0280 768.0199 828.1635 833.6831 895.4587 946.8833 1006.9969 1056.4046 1062.6711 1072.8715 1111.8390 1194.2003 1218.5895 1229.2152 1251.5773 1280.4263 1287.5705 1290.2511 1334.7545 1351.9203 1391.1680 1450.7721 1466.4267 1470.2962 1476.8133 1479.8164 1488.4093 1588.0304 2961.1803 2970.8644 2974.7411 2981.9994 3000.7575 3023.6108 3024.7614 3045.7647 3071.4074 3074.4080 3105.5001 3203.0763
redmass: 1.9979 5.7038 4.5275 4.0567 1.7837 2.8976 3.0365 15.8452 6.2583 1.1330 4.7389 11.9728 4.0060 8.0524 3.6502 5.8038 9.7970 6.1592 1.0677 8.9951 1.1160 1.2987 1.3064 4.7965 1.8357 1.1988 4.1749 2.9186 1.1277 2.5284 2.2977 1.6178 1.1175 1.2225 1.2796 1.2685 1.0561 1.1298 1.3912 1.5821 1.2141 1.0916 1.0666 1.0737 1.0425 1.0697 1.0892 9.7037 1.0586 1.0593 1.0364 1.0594 1.0987 1.1008 1.0576 1.1044 1.1008 1.0993 1.1095 1.0941
irintensity: 0.1995 0.0647 0.3690 0.7762 0.4265 0.6254 0.4819 0.8376 0.4728 0.0096 0.6683 0.5009 1.1494 3.4333 0.3712 13.5114 29.5700 9.6999 12.5578 113.7704 1.9793 41.4455 16.8133 61.6267 3.0576 0.8023 0.2665 4.8838 1.6643 0.6913 21.1944 0.3515 3.9162 1.1886 0.4331 14.5830 0.6959 0.7665 11.7194 0.1603 11.5746 5.9787 1.3754 1.1243 12.9884 2.9095 20.2939 25.8666 2.4971 37.3090 37.0941 50.4228 0.2909 6.4198 17.6837 40.9734 84.2734 51.0881 22.7101 11.9567
temp: 298.150 k
press: 1.00000 atm
elementType: 17 17 16 6 6 6 6 6 6 6 1 1 1 1 1 1 1 1 1 1 1 1
symmnumber: 1
zpe: 453943.7 jmol-1
zpe.correction: 0.172898 hartree
zpe.thermalcorrener: 0.185547 hartree
zpe.thermalcorrenthalpy: 0.186492 hartree
zpe.thermalcorrgfe: 0.131160 hartree
zpe.sumelectzpe: -1591.284025 hartree
zpe.sumelectthermal: -1591.271376 hartree
zpe.sumelectthermalent: -1591.270431 hartree
zpe.sumelectthermalfe: -1591.325763 hartree
dipole: 3.2445 -0.9748 0.9052
dipole: 3.5066
quadrupole: -84.9785 -81.9003 -84.9346
quadrupole: 2.8138 -0.2541 -1.2378
quadrupole: -1.0407 2.0375 -0.9968 2.8138 -0.2541 -1.2378
hfenergy: -1591.456923 hartree
pointgroup: C01 [X(C7H12Cl2S1)]
dipole: 1.2771981 -0.4429597 -0.2753613 debye
dipolederiv: -0.1695986 0.0133722 0.1085745 -0.0043124 -0.1942519 -0.2759716 0.2484407 -0.2961438 -0.6603926 -0.8617167 -0.2328509 0.1348076 -0.1336897 -0.063014 -0.0174583 0.3806571 0.0777422 -0.1078979 -0.4605189 -0.0017378 0.1420127 -0.0941954 -0.0777824 -0.0948663 0.0379586 -0.1609183 -0.123975 -0.1068126 -0.0008548 -0.0104511 -0.1189735 0.1616054 0.0406169 0.1597414 0.0419558 0.1186954 -0.1321671 0.0060748 -0.0257096 0.158822 0.1174072 0.0517034 -0.252877 0.0556535 0.0964617 0.0628649 0.008636 -0.0180495 0.0808604 0.146425 0.0406569 -0.1248568 0.0404118 0.1148559 0.4278638 -0.118327 0.122475 -0.1150266 0.1737078 0.0363484 0.2869685 0.0191669 0.0650321 -0.0941651 0.02838 -0.0496133 -0.0099546 0.0803883 0.0231323 0.0050022 0.0241028 0.0569652 0.2393055 0.0557232 -0.3203734 0.0936717 0.1423467 0.3945035 -0.4154105 0.5318559 0.8037507 0.8618717 0.3069531 -0.2227981 0.1775863 -0.1357495 0.0120674 -0.4585006 -0.132582 -0.078992 0.0452671 -0.0225019 0.001777 -0.0139407 -0.1864473 0.0356484 -0.0089409 0.0122041 0.0618895 0.0441438 0.009195 0.0337031 0.0161388 0.0452808 -0.0767039 0.0203805 -0.0537913 -0.1599196 0.0645246 0.0064267 0.0119043 -0.0014573 0.0511163 -0.0716594 0.0398701 -0.0550786 -0.1302568 0.0736017 -0.0140036 -0.0033497 -0.0268254 -0.1430397 0.0258585 0.0137002 0.0123463 0.0670566 0.027484 0.0001271 -0.0127983 0.0069754 0.0525338 -0.0831189 0.0296009 -0.0570458 -0.1830887 0.0288168 0.0216208 -0.0085247 -0.0198577 -0.1978769 0.0426608 0.0021591 0.0181419 0.0677562 0.0122609 0.0334029 -0.0020538 0.0414157 0.0491243 -0.0392051 -0.0251899 -0.0189085 -0.0795244 -0.0420617 0.012139 -0.0261428 0.0168013 -0.117441 0.0389095 -0.0732875 0.031305 0.0495329 0.0885171 0.0273955 0.0389549 0.0168237 0.0536954 -0.0887353 -0.0296338 -0.0678367 -0.1578625 0.0899197 -0.0338103 -0.0118888 0.0333606 -0.1856065 0.0278452 -0.0265946 0.0039009 0.0769423 -0.2137721 -0.0460847 0.0534353 -0.0618771 0.0775274 0.0324035 0.0757907 0.0334767 0.0564141 0.0143712 -0.0592754 0.0641086 -0.0423454 0.150051 -0.0546361 0.1150214 -0.0599587 0.0465568 unknown
polarizability: 176.9093248|11.9950691|81.0107677|-5.3130787|6.3866824|97.9494356 unknown
InChI: InChI=1S/C7H12Cl2S/c1-2-3-4-5-10-7(9)6-8/h6H,2-5H2,1H3
charge 0 multiplicity 1
22 atoms
Cl -2.645976 1.005369 1.513138
Cl -5.100322 -0.857667 0.23087
S  -1.060753 0.542592 -1.122883
C  2.846521 -0.297783 0.312396
C  1.687317 0.249584 -0.556562
C  4.23734 0.114563 -0.223306
C  0.318397 -0.161573 0.005519
C  5.394943 -0.429135 0.641372
C  -2.519741 0.187451 -0.116221
C  -3.517109 -0.596497 -0.591346
H  2.78614 -1.404788 0.359225
H  2.732982 0.067903 1.353804
H  1.799934 -0.124989 -1.593664
H  1.751788 1.354424 -0.604409
H  4.349673 -0.248725 -1.265071
H  4.296214 1.220791 -0.270434
H  0.145532 0.258128 1.010848
H  0.190257 -1.256345 0.033524
H  5.325109 -0.054609 1.679975
H  5.375801 -1.534611 0.681351
H  6.377337 -0.123134 0.237746
H  -3.434387 -1.126549 -1.54157
