program: Gaussian 09
title: 000224188
version: EM64L-G09RevD.01
frameworkgroup: C1[X(C5H10NO3PS)]
method: RPBEPBE
basis: SDD
operation: Freq
keyword: #p
keyword: freq=noraman
keyword: PBEPBE/SDD
title: #p freq=noraman PBEPBE/SDD
converged: YES YES NO NO
title: Mulliken charges:
elementType: S P O O O N C C C C C H H H H H H H H H H
charge: 0.104388 1.145870 -0.474670 -0.515038 -0.549695 0.033777 -0.242010 -0.260872 -0.645058 -0.646029 -0.327990 0.247277 0.228196 0.245305 0.237998 0.218453 0.255056 0.236774 0.227449 0.233602 0.247217
chargesum: 0.00000
title: Mulliken charges with hydrogens summed into heavy atoms:
elementType: S P O O O N C C C C C
charge: 0.104388 1.145870 -0.474670 -0.515038 -0.549695 0.033777 0.233464 0.222432 0.065224 0.062238 -0.327990
polarizability: 1.50143293e+02 -9.58130306e+00 1.12281690e+02 -8.42730221e-01 1.01974501e+00 9.54202183e+01
1716.lowfreq: -10.0486 -6.8000 0.0017 0.0025 0.0034 2.0063 21.8625 33.7555 36.4548
frequency: 21.8187 33.4878 36.4117 52.6006 72.8343 90.3902 131.5672 149.5188 152.4850 196.2251 225.2307 238.6532 246.9408 309.5959 315.6272 384.3626 400.2387 407.5420 426.0236 457.2115 589.2632 637.6502 667.9244 798.9358 804.7243 842.2016 861.2018 1000.0609 1005.9484 1055.7971 1091.3557 1094.8067 1136.2620 1139.4824 1262.9286 1265.3518 1344.6872 1348.2177 1394.8446 1396.6489 1458.0758 1461.1342 1464.6845 1466.8302 1477.2478 1487.2305 2090.9941 2991.4622 2992.7124 3005.7977 3024.2189 3084.2513 3086.7909 3090.2331 3091.8680 3115.6286 3117.1031
redmass: 8.5911 3.0278 2.6744 3.7173 4.8641 4.4978 2.8231 8.5295 4.7350 2.8013 7.5140 1.4156 1.3712 5.2440 3.7771 12.5352 5.9536 4.1703 6.7700 5.0943 7.5242 17.9180 7.0260 1.1171 1.1177 4.0071 4.5032 2.4996 2.6220 15.9290 2.2402 2.2361 1.5162 1.5006 1.1262 1.1236 1.2149 1.2137 1.2217 1.2234 1.0400 1.0717 1.0450 1.0788 1.0573 1.0535 12.7499 1.0363 1.0367 1.0634 1.0606 1.1003 1.1014 1.0974 1.1003 1.1059 1.1033
irintensity: 1.0232 1.7677 0.4601 1.0741 1.5991 1.9372 3.9316 0.5559 1.4879 8.7218 3.1501 2.1758 5.8816 14.5034 2.9008 0.8304 75.1391 9.0247 12.8108 42.8902 107.7020 0.9831 78.7292 3.4692 6.3755 135.2378 160.1102 174.1533 70.3528 96.5786 7.6121 3.8949 6.2620 6.5585 0.2122 0.3137 16.9086 15.8420 34.5805 28.7485 11.5409 8.2959 13.6857 3.6450 11.9638 12.1864 18.3536 8.9522 14.0520 14.9728 22.7609 22.6639 4.5613 17.8244 8.8811 22.8854 21.3498
temp: 298.150 k
press: 1.00000 atm
elementType: 16 15 8 8 8 7 6 6 6 6 6 1 1 1 1 1 1 1 1 1 1
symmnumber: 1
zpe: 398316.5 jmol-1
zpe.correction: 0.151711 hartree
zpe.thermalcorrener: 0.166880 hartree
zpe.thermalcorrenthalpy: 0.167825 hartree
zpe.thermalcorrgfe: 0.106546 hartree
zpe.sumelectzpe: -1215.313167 hartree
zpe.sumelectthermal: -1215.297998 hartree
zpe.sumelectthermalent: -1215.297053 hartree
zpe.sumelectthermalfe: -1215.358332 hartree
dipole: -5.1893 2.6599 -3.6353
dipole: 6.8716
quadrupole: -85.2611 -74.4861 -88.4009
quadrupole: 10.2196 -2.7708 0.9544
quadrupole: -2.5450 8.2299 -5.6849 10.2196 -2.7708 0.9544
hfenergy: -1215.464878 hartree
pointgroup: C01 [X(C5H10N1O3P1S1)]
dipole: -2.1711683 -1.5254136 0.5176193 debye
dipolederiv: -0.2854099 -0.1180242 -0.1426403 -0.1423739 -0.1625607 -0.0712083 -0.2862222 -0.2309471 -0.2737619 1.9702284 -0.3776244 0.3331537 0.244157 1.7883992 0.1936945 0.453179 0.5079489 1.6547158 -0.4924018 0.2831759 -0.0387394 0.0269351 -1.4615713 0.0155449 -0.1475673 0.1824451 -0.5848549 -1.5823521 0.2918313 -0.1645337 0.1417549 -0.6430779 -0.0213134 -0.0382525 -0.0316165 -0.478625 -0.6112411 0.0729538 -0.0515168 -0.0126821 -0.556834 0.0246903 -0.0951229 -0.0099802 -0.6853402 -0.3218298 -0.0865627 -0.0864802 -0.0422283 -0.1960304 -0.0244573 0.0168969 0.0099697 -0.1541276 0.2639179 0.071552 -0.0038355 -0.0093875 0.9582275 -0.048639 0.0829692 -0.4622815 0.2603045 0.8771121 -0.2081179 0.042593 -0.5968001 0.4058209 -0.0564998 0.1476981 0.018144 0.292056 -0.0847767 -0.1142189 0.0101956 -0.0818977 -0.1900193 0.0004192 -0.0212179 0.0874621 0.0539536 -0.0723419 0.0676455 0.019402 0.16014 -0.1370488 -0.0779126 -0.0085902 -0.1098113 -0.0289756 0.2652742 0.1649417 0.082453 0.1123925 -0.0014763 0.0070221 -0.0446557 -0.0363142 -0.1496817 -0.0687525 0.0303599 0.0189312 0.0537759 -0.0475967 0.0112207 0.025562 0.0504225 0.0901685 0.0664363 -0.0446161 -0.0034578 -0.01505 -0.0128307 -0.0898988 -0.0372531 0.0164903 -0.0643665 0.0217715 0.018253 0.0579682 0.0941588 0.0473072 0.037906 -0.0373111 0.0107995 -0.0964543 -0.1047226 -0.0546879 -0.0268883 -0.0008268 -0.0422124 0.005135 -0.0196765 0.0080156 0.094218 0.0988788 0.0102672 -0.0434861 0.0193309 -0.0869981 0.1001555 -0.036786 0.1226482 0.0199452 -0.054848 0.0518029 0.0356787 0.08157 0.1084265 -0.0262317 0.0298183 -0.0622015 0.0862543 0.0801736 -0.0190898 0.0136896 -0.0180492 0.0859903 -0.0471949 -0.0109086 -0.1136461 -0.0935349 -0.105574 0.1012511 -0.0528268 0.1115947 0.0641102 0.0103411 -0.0563571 0.0138482 0.0959787 0.1411154 -0.011804 -0.016972 -0.0154725 0.053098 0.0633154 0.0190004 0.0266441 -0.1041051 -0.0006578 -0.1292884 0.0173118 -0.1110415 0.0268769 -0.0060889 0.0647972 0.0019601 0.0662332 unknown
polarizability: 141.9355685|10.4331095|112.9140132|16.9842067|8.4942196|102.9956197 unknown
InChI: InChI=1S/C4H10O3P.CNS/c1-3-6-8(5)7-4-2;2-1-3/h3-4H2,1-2H3;
charge 0 multiplicity 1
21 atoms
S  0.288243 0.846927 1.658655
P  -0.31667 0.106301 -0.571891
O  0.63131 -1.290913 -0.824303
O  -1.881256 -0.489823 -0.140402
O  -0.238304 1.167212 -1.742526
N  3.081578 1.654456 1.269829
C  0.744102 -2.405482 0.175878
C  -3.09686 0.292878 -0.56092
C  -0.375896 -3.429364 0.001905
C  -3.333618 1.505089 0.339233
C  1.936299 1.316933 1.394062
H  1.735783 -2.8261 -0.056881
H  0.76521 -1.974606 1.195416
H  -2.984343 0.582568 -1.621284
H  -3.897575 -0.458091 -0.464191
H  -0.197193 -4.27975 0.686804
H  -1.359944 -2.98987 0.23486
H  -0.393229 -3.817604 -1.030361
H  -4.293809 1.981028 0.066128
H  -3.388615 1.206581 1.400009
H  -2.537214 2.260429 0.220178
