program: Gaussian 09
title: 000224223
version: EM64L-G09RevD.01
frameworkgroup: C1[X(C19H15Br)]
method: RPBEPBE
basis: SDD
operation: Freq
keyword: #p
keyword: freq=noraman
keyword: PBEPBE/SDD
title: #p freq=noraman PBEPBE/SDD
converged: YES YES NO NO
title: Mulliken charges:
elementType: Br C C C C C C C C C C C C C C C C C C C H H H H H H H H H H H H H H H
charge: 0.001382 -0.482271 0.451613 0.431110 0.443225 -0.405934 -0.373862 -0.411108 -0.418309 -0.383463 -0.382580 -0.188452 -0.193208 -0.234783 -0.233272 -0.239151 -0.238446 -0.225746 -0.243211 -0.243633 0.218928 0.244224 0.263439 0.236213 0.236078 0.256737 0.253131 0.249291 0.249204 0.226322 0.225946 0.226312 0.226804 0.228735 0.228732
chargesum: 0.00000
title: Mulliken charges with hydrogens summed into heavy atoms:
elementType: Br C C C C C C C C C C C C C C C C C C C
charge: 0.001382 -0.263343 0.451613 0.431110 0.443225 -0.161710 -0.110422 -0.174895 -0.182231 -0.126726 -0.129449 0.060839 0.055996 -0.008461 -0.007325 -0.012840 -0.011642 -0.225746 -0.014476 -0.014901
polarizability: 2.63864605e+02 -5.83441397e-01 2.13506253e+02 1.64353890e+00 -6.66747341e-01 1.62703086e+02
1716.lowfreq: -14.0842 -4.9921 -0.0001 0.0003 0.0006 7.1937 23.0273 30.9917 32.8523
frequency: 22.5410 30.8542 32.3963 44.9546 54.5179 66.7081 125.3897 167.2682 194.6217 226.2449 238.2359 280.5896 294.0778 327.2046 359.5478 401.8676 403.8388 407.0091 472.3113 498.8367 505.8299 601.3431 612.8311 615.8473 621.1905 630.8229 667.6775 705.8495 707.3654 717.5067 744.4805 763.5633 802.2940 834.7452 841.5564 853.6581 855.9753 858.5894 868.5915 927.6419 932.5041 959.7751 976.3678 978.9659 981.6098 990.7246 991.1549 995.4776 996.5610 998.2943 1025.8053 1027.9281 1061.2794 1080.6389 1084.5656 1110.7301 1165.0360 1172.1236 1172.3717 1188.9370 1190.3249 1191.8854 1201.3094 1202.1522 1264.8086 1266.7493 1300.3137 1325.1209 1337.3087 1367.2468 1380.7756 1384.9097 1392.1945 1436.6480 1441.0770 1470.4768 1480.6321 1481.7925 1578.7212 1589.8327 1592.8703 1594.5052 1609.3048 1612.8969 2973.7524 3113.9778 3115.4436 3124.7318 3125.0676 3126.2599 3136.9558 3137.3072 3143.9346 3147.1704 3147.8557 3162.9419 3163.2985 3167.1136 3170.3437
redmass: 4.0811 3.8118 6.6070 3.8299 5.6356 5.3099 6.4115 6.6425 7.9498 4.5256 4.6988 4.9849 5.3101 4.7759 6.4414 2.8176 2.8389 2.8842 3.5871 3.4540 3.5542 4.9984 6.1714 6.0027 6.3991 5.9262 5.0798 1.7312 1.8097 4.0293 2.1382 1.9717 2.0847 1.3645 2.1512 2.5511 1.4562 1.2656 2.7560 1.4832 1.5034 1.3700 1.3698 1.3943 1.4073 5.6731 6.1458 4.7780 1.3187 1.3287 2.3192 2.1898 2.6084 1.6273 1.6029 1.3979 3.0693 1.0566 1.0576 1.1145 1.1152 1.1157 2.3442 2.2861 1.6195 1.5752 1.3125 1.3897 1.2749 5.4853 7.0650 6.7147 2.6042 2.1894 2.1485 2.3482 2.2277 2.2458 7.3232 6.1212 6.0467 5.9965 5.9704 6.0474 1.0824 1.0873 1.0870 1.0861 1.0861 1.0897 1.0915 1.0914 1.0888 1.0957 1.0955 1.1014 1.1014 1.0951 1.0962
irintensity: 0.0339 0.0613 0.0121 0.0147 0.1561 0.0848 0.0067 0.7055 0.0479 1.0777 0.2130 0.3312 0.6697 0.1823 8.9190 0.2306 0.2029 0.1117 6.4046 15.8380 21.9978 16.6951 0.2824 2.4904 3.8673 1.0405 8.6123 51.3440 43.4167 7.1051 44.9453 59.3626 29.3674 3.0429 14.3520 5.6756 1.7588 0.1702 13.0507 1.9558 1.9542 0.2988 0.0336 0.0140 0.1841 2.4411 1.8981 64.3805 1.1464 1.1164 6.3140 12.5979 26.5674 1.1356 13.2589 7.2534 1.4143 0.0533 0.0817 1.3348 1.9805 1.3703 0.7125 0.1544 0.8963 1.0292 1.0416 2.0489 0.6538 0.1388 0.6435 0.5594 6.8161 11.3578 7.0072 95.0240 19.1422 25.3803 2.4715 2.2953 1.3492 3.7665 15.0623 7.2214 12.2740 7.7202 6.6663 0.0543 0.0068 8.7289 10.8246 20.1065 2.7032 29.7146 35.2740 38.4342 17.2788 9.1257 0.8574
temp: 298.150 k
press: 1.00000 atm
elementType: 35 6 6 6 6 6 6 6 6 6 6 6 6 6 6 6 6 6 6 6 1 1 1 1 1 1 1 1 1 1 1 1 1 1 1
symmnumber: 1
zpe: 723305.5 jmol-1
zpe.correction: 0.275493 hartree
zpe.thermalcorrener: 0.292308 hartree
zpe.thermalcorrenthalpy: 0.293253 hartree
zpe.thermalcorrgfe: 0.227120 hartree
zpe.sumelectzpe: -745.112687 hartree
zpe.sumelectthermal: -745.095871 hartree
zpe.sumelectthermalent: -745.094927 hartree
zpe.sumelectthermalfe: -745.161059 hartree
dipole: 2.4458 0.0036 0.3710
dipole: 2.4738
quadrupole: -131.5676 -117.8412 -117.8526
quadrupole: -0.1133 -0.9420 -0.7000
quadrupole: -9.1471 4.5793 4.5679 -0.1133 -0.9420 -0.7000
hfenergy: -745.3881791 hartree
pointgroup: C01 [X(C19H15Br1)]
dipole: -0.9517168 0.0540094 0.1963681 debye
polarizability: 263.1819465|-3.4303596|213.7404188|-6.9017092|0.9416244|163.1515788 unknown
InChI: InChI=1S/C19H15Br/c20-18-13-11-17(12-14-18)19(15-7-3-1-4-8-15)16-9-5-2-6-10-16/h1-14,19H
charge 0 multiplicity 1
35 atoms
Br 5.825832 -0.338657 -0.602875
C  -0.343955 0.019591 0.794353
C  1.148186 -0.108248 0.439665
C  -1.16653 -1.198709 0.335229
C  -0.946565 1.357046 0.326477
C  2.103341 0.602918 1.210802
C  1.610304 -0.888767 -0.647436
C  -1.094191 -2.399324 1.088897
C  -2.049198 1.900956 1.035141
C  -1.971929 -1.17818 -0.829768
C  -0.460283 2.052716 -0.807855
C  3.481983 0.543754 0.913981
C  2.987272 -0.961209 -0.96414
C  -1.806673 -3.550863 0.690834
C  -2.651191 3.109546 0.623441
C  -2.686547 -2.330481 -1.232749
C  -1.0613 3.263211 -1.224417
C  3.907166 -0.241288 -0.177854
C  -2.606816 -3.521073 -0.475899
C  -2.158569 3.796644 -0.511356
H  -0.397652 0.028343 1.903052
H  1.767253 1.218821 2.053862
H  0.896246 -1.460149 -1.249782
H  -0.470261 -2.430944 1.991307
H  -2.439375 1.368894 1.912074
H  -2.053287 -0.255728 -1.41509
H  0.399355 1.655208 -1.358593
H  4.206936 1.094601 1.519972
H  3.33079 -1.570304 -1.805251
H  -1.740792 -4.467307 1.288188
H  -3.499313 3.516392 1.185772
H  -3.307714 -2.295519 -2.135074
H  -0.669855 3.789872 -2.102212
H  -3.163621 -4.412223 -0.786581
H  -2.621648 4.736759 -0.831417
