program: Gaussian 09
title: 000224175
version: EM64L-G09RevD.01
frameworkgroup: C1[X(C13H20N2O2)]
method: RPBEPBE
basis: SDD
operation: Freq
keyword: #p
keyword: freq=noraman
keyword: PBEPBE/SDD
title: #p freq=noraman PBEPBE/SDD
converged: YES YES NO NO
title: Mulliken charges:
elementType: O O N N C C C C C C C C C C C C C H H H H H H H H H H H H H H H H H H H H
charge: -0.440201 -0.265759 -0.135609 -0.446251 -0.475814 -0.322700 -0.310454 0.365588 -0.615971 0.068120 -0.682239 -0.673952 0.519906 -0.372663 -0.362327 0.204398 -0.802080 0.225742 0.236384 0.190065 0.229326 0.188241 0.200334 0.266838 0.217805 0.208322 0.212105 0.222437 0.212958 0.207511 0.216222 0.309193 0.311325 0.356190 0.235875 0.266997 0.234137
chargesum: 0.00000
title: Mulliken charges with hydrogens summed into heavy atoms:
elementType: O O N N C C C C C C C C C C C C C
charge: -0.084011 -0.265759 -0.135609 -0.134926 -0.013687 0.096692 0.078121 0.365588 -0.349133 0.068120 -0.044007 -0.031046 0.519906 -0.156441 -0.053133 0.204398 -0.065070
polarizability: 2.15127976e+02 -1.22886750e+01 1.82618090e+02 -4.36406164e+00 -5.92251480e+00 1.10601359e+02
1716.lowfreq: -84.2523 -7.5551 -3.5794 -0.0006 -0.0006 0.0002 6.4301 24.7762 36.1871
frequency: -84.2461 24.6716 36.1108 49.1773 61.7769 76.1657 79.9539 99.6105 147.5453 157.6775 193.2261 198.0208 214.5324 236.4797 288.8630 290.5886 304.4677 314.3937 351.7353 365.7838 372.7664 429.4793 437.3016 457.7348 491.6278 519.4974 568.0707 587.1892 597.6258 625.1020 647.5987 720.6082 750.9152 773.1351 783.3712 797.6466 801.6604 816.0138 892.2951 895.9840 925.4128 959.0493 962.0597 989.2663 996.6936 1001.7363 1029.0488 1058.7046 1074.6000 1082.6784 1086.4459 1113.0591 1153.7561 1161.3900 1168.3075 1203.4789 1220.8597 1230.3152 1250.0619 1262.7490 1288.1462 1289.2319 1309.2734 1354.2862 1362.6035 1374.1013 1374.4704 1379.2968 1387.9497 1388.4939 1418.6471 1450.3283 1459.3766 1464.0382 1468.4286 1468.7014 1474.6466 1478.8178 1484.6084 1490.6993 1491.9133 1522.0380 1609.5876 1624.7249 1627.8934 2855.2709 2864.5293 2902.5022 2981.6409 2982.1338 2985.9728 3012.9282 3030.1371 3037.8844 3070.8775 3074.4129 3076.3383 3084.4452 3089.3962 3109.7699 3114.1064 3134.9004 3197.2337 3524.0492 3583.3637
redmass: 1.0523 3.2634 3.9703 3.3360 4.5021 3.8748 1.9550 2.1674 3.5924 3.4053 2.2998 1.6313 2.7731 1.8914 2.7167 1.9887 3.1109 3.3298 1.1100 3.5805 5.4952 2.8051 3.1525 2.9006 4.5250 3.4263 3.2752 3.7566 3.2513 6.0084 1.2411 3.7628 2.8333 4.2350 3.3700 1.2249 1.3448 1.4299 3.5034 2.0221 1.5090 2.8733 1.3285 2.3542 1.7790 1.7836 1.6481 2.6327 1.9869 2.3116 1.9947 1.8876 1.3307 1.6511 1.5583 2.2991 1.8321 2.3319 1.7873 1.3108 1.4827 1.2345 1.9400 1.5060 1.3687 1.3063 1.3922 3.6631 1.2502 1.2390 3.1997 1.1249 1.0823 1.0540 1.0529 1.0479 1.0635 1.0630 1.0598 1.0837 3.0307 2.1296 7.0178 6.9294 4.8651 1.0722 1.0716 1.0700 1.0357 1.0358 1.0383 1.0869 1.0882 1.0874 1.0984 1.0986 1.0979 1.1002 1.1004 1.0907 1.0908 1.0978 1.0945 1.0765 1.0659
irintensity: 0.0168 0.2388 2.0786 0.4999 5.5281 4.0961 0.2590 1.0810 7.1657 3.7898 2.7811 0.8986 5.4989 2.0380 0.9837 2.9102 2.3439 1.3318 121.3787 2.9750 3.1885 2.1262 8.0088 4.6509 27.0016 6.4091 14.4081 2.2019 14.4631 2.7095 57.3978 0.6746 12.6591 8.1521 4.4219 8.1912 8.0544 46.0386 5.9691 3.6094 22.6773 19.5859 7.5458 10.5005 15.8687 13.3776 7.6686 48.2311 18.1537 67.8800 45.7709 12.9584 96.2670 9.3980 18.5922 48.1770 13.1394 60.3672 78.8717 34.6975 9.1097 20.0545 75.9131 5.1956 6.2395 35.0866 4.3929 72.3178 23.7367 21.0488 22.6287 46.0019 2.1078 3.9333 8.4536 16.1626 4.9672 10.8056 9.3777 34.8259 362.7134 154.0938 20.8619 47.3487 129.1760 31.5082 172.1417 57.7206 33.9087 24.9952 10.8971 14.6454 10.3894 15.4052 16.3641 30.2273 85.5425 57.8354 38.0124 16.1233 15.8850 8.1926 6.1749 12.4348 35.5819
temp: 298.150 k
press: 1.00000 atm
elementType: 8 8 7 7 6 6 6 6 6 6 6 6 6 6 6 6 6 1 1 1 1 1 1 1 1 1 1 1 1 1 1 1 1 1 1 1 1
symmnumber: 1
zpe: 814299.7 jmol-1
zpe.correction: 0.310150 hartree
zpe.thermalcorrener: 0.328321 hartree
zpe.thermalcorrenthalpy: 0.329265 hartree
zpe.thermalcorrgfe: 0.262599 hartree
zpe.sumelectzpe: -766.024420 hartree
zpe.sumelectthermal: -766.006250 hartree
zpe.sumelectthermalent: -766.005306 hartree
zpe.sumelectthermalfe: -766.071972 hartree
dipole: -2.6894 -1.6481 -0.0154
dipole: 3.1543
quadrupole: -115.5131 -84.0196 -104.3268
quadrupole: -5.9172 1.6936 -2.6591
quadrupole: -14.2266 17.2669 -3.0403 -5.9172 1.6936 -2.6591
hfenergy: -766.3345708 hartree
pointgroup: C01 [X(C13H20N2O2)]
dipole: -1.0669287 -0.6323957 -0.042107 debye
polarizability: 214.8987479|-12.5661666|183.2448936|-2.8874447|-4.1719624|110.2037843 unknown
InChI: InChI=1S/C13H20N2O2/c1-4-15(5-2)9-11-8-12(14-10(3)16)6-7-13(11)17/h6-8,14,17H,4-5,9H2,1-3H3
charge 0 multiplicity 1
37 atoms
O  -1.145684 3.390552 -0.106937
O  4.534392 -0.123757 0.041193
N  -2.681973 -0.576339 -0.117748
N  2.376035 -1.030772 0.228357
C  -2.260945 0.808528 0.217231
C  -2.688439 -0.79874 -1.592315
C  -3.967602 -0.94774 0.533928
C  -0.754253 1.018708 0.110839
C  0.146354 -0.06015 0.19556
C  -0.218175 2.324451 -0.042743
C  -2.594919 -2.285058 -1.984593
C  -3.810134 -1.267158 2.032878
C  1.551023 0.130622 0.126905
C  1.177399 2.526615 -0.118699
C  2.072164 1.439525 -0.035664
C  3.767003 -1.121891 0.188409
C  4.294299 -2.550957 0.342134
H  -2.571386 1.024928 1.257416
H  -2.777421 1.569305 -0.414227
H  -3.591714 -0.336346 -2.065591
H  -1.810599 -0.269441 -2.006307
H  -4.738911 -0.147846 0.395861
H  -4.357589 -1.846868 0.024002
H  -0.294865 -1.05895 0.313023
H  -1.672742 -2.731999 -1.572482
H  -3.453359 -2.872122 -1.611129
H  -2.573747 -2.389811 -3.085328
H  -3.100361 -2.101354 2.171767
H  -3.43068 -0.400241 2.603614
H  -4.784482 -1.553923 2.471051
H  1.579885 3.541066 -0.241693
H  3.151317 1.587693 -0.093621
H  1.868768 -1.910461 0.351364
H  -0.67454 4.249764 -0.241206
H  3.999508 -2.985575 1.315515
H  5.391886 -2.525685 0.285509
H  3.912581 -3.210979 -0.459077
