program: Gaussian 09
title: 000224173
version: EM64L-G09RevD.01
frameworkgroup: C1[X(C10H14N2O4)]
method: RPBEPBE
basis: SDD
operation: Freq
keyword: #p
keyword: freq=noraman
keyword: PBEPBE/SDD
title: #p freq=noraman PBEPBE/SDD
converged: YES YES NO NO
title: Mulliken charges:
elementType: O O O O N N C C C C C C C C C C H H H H H H H H H H H H H H
charge: -0.296039 -0.191846 -0.246764 -0.182217 -0.470250 0.015142 0.269982 -0.439746 -0.445994 0.167763 -0.178962 0.244232 -0.063115 -0.255078 -0.778037 -0.653819 0.298953 0.263387 0.245389 0.249571 0.348968 0.171701 0.228052 0.242173 0.258970 0.216304 0.261553 0.226809 0.256596 0.236323
chargesum: 0.00000
title: Mulliken charges with hydrogens summed into heavy atoms:
elementType: O O O O N N C C C C C C C C C C
charge: -0.296039 -0.191846 -0.246764 -0.182217 -0.121281 0.015142 0.269982 0.122593 0.048967 0.167763 -0.178962 0.244232 0.108586 0.215146 -0.041210 0.065908
polarizability: 1.39063841e+02 -1.02577106e+00 1.24644444e+02 3.86701343e+00 -2.57280272e+00 1.22385591e+02
1716.lowfreq: -10.0927 -2.3826 -0.0005 0.0002 0.0008 5.8900 18.4441 30.2809 40.5598
frequency: 17.4942 30.2392 40.5169 46.7571 52.7062 76.4561 86.1992 94.5671 96.4107 119.1092 150.5670 166.7519 182.2998 206.4592 233.4239 236.7628 281.0849 319.4301 345.7512 387.9310 406.6961 452.1332 462.5653 534.2089 544.6139 595.5279 624.0279 663.9760 680.6944 689.7438 717.4193 771.2367 817.3297 828.7577 849.0837 894.4095 900.4892 971.6443 988.0774 1005.1583 1020.5282 1040.6126 1075.2204 1095.3950 1100.5321 1131.6807 1152.6875 1156.5840 1205.2689 1260.2113 1274.4089 1280.1504 1304.2240 1351.2172 1359.6230 1379.7739 1387.2154 1397.0946 1427.5498 1446.6273 1451.8450 1458.7149 1459.7470 1464.0866 1468.8437 1483.2195 1626.4986 1648.2664 1654.6211 2184.5613 2861.9522 2963.6007 2998.2007 2998.8540 3011.6640 3037.0508 3049.0751 3094.5021 3095.4959 3101.3949 3108.8743 3121.6779 3127.4081 3521.8498
redmass: 4.0772 7.0915 1.4171 3.1664 3.4539 3.1363 4.2644 6.1266 4.7562 3.4858 6.1954 1.8075 3.8484 1.5650 5.5575 3.8656 2.5276 2.7796 5.0205 6.2159 4.2514 5.8994 5.3574 5.1192 5.0897 2.8206 1.3786 1.3566 4.2244 3.6864 3.9615 2.3897 1.5107 3.8321 1.8472 3.2268 3.3917 2.9075 1.7340 2.6024 3.5759 1.6640 2.9535 2.4835 2.6627 3.1682 5.8814 1.6389 1.4754 2.3258 1.1375 1.5578 1.1807 1.2707 1.4439 1.2253 1.2231 1.2228 1.1183 1.1428 1.0908 1.1035 1.3473 1.0559 1.1695 1.0524 6.7777 7.6655 10.1658 12.6848 1.0845 1.0619 1.0362 1.0364 1.0958 1.0598 1.0617 1.0975 1.0991 1.1033 1.0997 1.1020 1.1068 1.0776
irintensity: 2.1767 2.0040 0.0890 3.3836 5.2329 3.8498 2.6132 1.1769 1.5349 0.3215 5.2772 0.8840 6.5431 9.6396 5.2028 3.5456 4.9261 6.3952 7.2763 1.7442 3.8694 2.6129 1.2221 19.0528 19.3334 54.4274 30.7650 18.2236 3.7680 17.8195 19.6535 7.0782 5.7347 11.7232 1.7179 13.4658 5.6059 12.8568 2.0048 75.4053 14.8684 11.6227 136.6278 15.6005 5.8437 57.8767 177.5300 11.5627 12.6002 94.2961 3.1850 53.2282 14.6250 0.8718 2.2595 6.1460 72.2275 26.3527 20.4072 111.5192 35.8145 44.7044 204.3147 16.5862 33.0625 16.3752 130.5731 157.9969 122.8734 0.3912 149.6269 30.2003 7.8524 11.0928 8.5992 24.8643 5.0459 24.2433 12.5621 1.3008 11.4614 0.4054 22.9551 68.8156
temp: 298.150 k
press: 1.00000 atm
elementType: 8 8 8 8 7 7 6 6 6 6 6 6 6 6 6 6 1 1 1 1 1 1 1 1 1 1 1 1 1 1
symmnumber: 1
zpe: 606550.5 jmol-1
zpe.correction: 0.231023 hartree
zpe.thermalcorrener: 0.249712 hartree
zpe.thermalcorrenthalpy: 0.250656 hartree
zpe.thermalcorrgfe: 0.180874 hartree
zpe.sumelectzpe: -798.612595 hartree
zpe.sumelectthermal: -798.593906 hartree
zpe.sumelectthermalent: -798.592962 hartree
zpe.sumelectthermalfe: -798.662744 hartree
dipole: -5.4981 1.3961 -7.8820
dipole: 9.7111
quadrupole: -94.2115 -98.5868 -100.0192
quadrupole: 3.4126 -3.1755 -3.3557
quadrupole: 3.3943 -0.9810 -2.4133 3.4126 -3.1755 -3.3557
hfenergy: -798.8436181 hartree
pointgroup: C01 [X(C10H14N2O4)]
dipole: -2.1233302 0.5561472 3.127191 debye
polarizability: 138.932352|-0.0591366|122.5941763|-4.1619413|-2.762942|124.5673482 unknown
InChI: InChI=1S/C10H14N2O4/c1-3-16-9(15)10(7-11,5-4-6-13)12-8(2)14/h6,12H,3-5H2,1-2H3
charge 0 multiplicity 1
30 atoms
O  -2.237633 0.145661 0.955809
O  -1.555967 1.747019 -0.596637
O  2.113383 -2.009411 0.450403
O  3.282105 2.461307 -1.049325
N  0.109933 -0.994368 1.092571
N  -0.767467 -1.90904 -2.154628
C  -0.104501 -0.232589 -0.158848
C  1.114251 0.636961 -0.595441
C  1.580686 1.598502 0.508096
C  -1.360523 0.687186 0.026101
C  -0.46324 -1.167835 -1.271511
C  1.175337 -1.8729 1.287317
C  2.753916 2.46782 0.086397
C  -3.555199 0.85334 1.139921
C  1.119075 -2.663495 2.591406
C  -4.550064 0.405784 0.069142
H  1.934428 -0.039956 -0.878534
H  0.81593 1.208668 -1.490356
H  0.769758 2.289755 0.824158
H  1.883749 1.050497 1.424145
H  -0.69473 -1.028378 1.724612
H  3.133249 3.151293 0.890715
H  -3.861952 0.554911 2.15438
H  -3.366027 1.939977 1.098558
H  2.094633 -2.586854 3.099499
H  0.32562 -2.327777 3.280872
H  0.957046 -3.729976 2.354646
H  -5.532457 0.873494 0.26501
H  -4.218453 0.715803 -0.935567
H  -4.680886 -0.689399 0.081193
