program: Gaussian 09
title: 000224172
version: EM64L-G09RevD.01
frameworkgroup: C1[X(C10H10N2O5)]
method: RPBEPBE
basis: SDD
operation: Freq
keyword: #p
keyword: freq=noraman
keyword: PBEPBE/SDD
title: #p freq=noraman PBEPBE/SDD
converged: YES YES NO NO
title: Mulliken charges:
elementType: O O O O O N N C C C C C C C C C C H H H H H H H H H H
charge: -0.272968 -0.310505 -0.240997 -0.207898 -0.209976 -0.448364 0.016023 0.344918 0.064394 -0.461046 -0.304799 0.425150 -0.381312 0.229686 0.215779 -0.786509 -0.493052 0.325684 0.323380 0.291615 0.383467 0.246028 0.266688 0.245849 0.247157 0.244431 0.247175
chargesum: 0.00000
title: Mulliken charges with hydrogens summed into heavy atoms:
elementType: O O O O O N N C C C C C C C C C C
charge: -0.272968 -0.310505 -0.240997 -0.207898 -0.209976 -0.064896 0.016023 0.344918 0.064394 -0.135362 0.018581 0.425150 -0.089697 0.229686 0.215779 -0.027944 0.245712
polarizability: 2.34540376e+02 5.08325861e-01 1.82868396e+02 -2.68859660e-02 9.05828204e-03 6.42383526e+01
1716.lowfreq: -50.9856 -5.3388 -0.0003 0.0003 0.0004 4.1643 7.4203 51.0767 55.9289
frequency: -50.9571 51.0675 55.8918 62.3885 89.6252 100.9058 118.4913 123.9135 123.9458 164.7476 192.1616 232.6715 266.8563 289.0517 318.6875 329.1590 380.2896 419.6753 448.0861 471.4454 518.2464 526.7222 587.6827 597.7968 664.6551 667.8785 682.9799 716.6157 754.5991 773.5978 809.2768 857.3254 882.5646 919.5800 928.8321 944.5379 968.6231 990.2352 1020.9876 1036.7311 1060.2318 1108.6291 1114.9847 1136.3062 1153.7775 1205.8623 1226.6436 1236.1358 1266.4062 1303.9452 1361.5260 1381.0373 1391.9151 1419.4132 1433.6016 1442.7860 1454.6218 1460.2902 1463.8294 1463.9519 1518.0556 1578.2439 1585.4958 1628.1217 1654.1318 2993.2691 3011.4565 3077.9401 3116.1198 3140.5418 3159.7048 3178.1171 3197.4802 3199.3439 3228.6467
redmass: 1.0412 7.1075 7.5559 5.6584 1.6534 2.5720 4.3773 6.3496 2.7194 6.6200 4.6670 5.8804 6.6410 6.4070 5.7607 6.1156 9.6065 5.0168 3.9107 7.1319 3.6727 5.7058 3.0154 5.7753 6.2994 7.7811 7.6738 7.2150 8.4321 4.6986 4.8650 7.1844 1.4529 7.0570 1.1191 6.3078 1.4354 1.7063 1.3196 1.6814 2.7623 3.3802 1.2597 1.4152 1.5330 5.9015 4.4443 1.9801 2.0764 2.5940 8.8658 1.2471 5.3321 2.6601 1.8764 1.3580 1.0492 1.2139 1.0462 1.5127 3.1651 6.7037 4.8508 7.4444 2.7298 1.0383 1.0295 1.0978 1.1050 1.0988 1.1052 1.0907 1.0939 1.0944 1.0821
irintensity: 0.8594 0.0490 0.6654 0.1614 2.1882 10.1264 1.4335 2.7348 1.0891 0.2598 6.7137 11.2461 4.0106 0.1301 9.9282 0.0526 12.0346 0.7609 0.4529 13.6512 9.8576 4.3448 0.0138 1.6662 14.2892 23.1295 24.1605 2.6091 6.2502 1.2342 1.3957 7.7663 46.4529 17.8050 78.0955 0.9560 19.2772 48.8380 1.2656 14.0798 72.6623 81.5906 0.0349 20.5846 74.4805 659.2171 182.8831 135.7587 239.8092 252.0962 105.2894 54.4228 86.0540 52.2594 49.1175 33.8252 16.2881 24.5571 20.1442 7.0608 476.0338 5.3808 379.4674 255.6301 6.0044 2.7448 31.3099 9.8866 21.3905 9.4210 10.8019 4.8561 16.9530 0.1843 236.6685
temp: 298.150 k
press: 1.00000 atm
elementType: 8 8 8 8 8 7 7 6 6 6 6 6 6 6 6 6 6 1 1 1 1 1 1 1 1 1 1
symmnumber: 1
zpe: 511051.2 jmol-1
zpe.correction: 0.194649 hartree
zpe.thermalcorrener: 0.210188 hartree
zpe.thermalcorrenthalpy: 0.211133 hartree
zpe.thermalcorrgfe: 0.150624 hartree
zpe.sumelectzpe: -871.396941 hartree
zpe.sumelectthermal: -871.381402 hartree
zpe.sumelectthermalent: -871.380458 hartree
zpe.sumelectthermalfe: -871.440966 hartree
dipole: -5.1633 4.5678 -0.0027
dipole: 6.8938
quadrupole: -116.6453 -91.8177 -96.9576
quadrupole: -1.0657 0.0097 -0.0232
quadrupole: -14.8385 9.9892 4.8493 -1.0657 0.0097 -0.0232
hfenergy: -871.5915904 hartree
pointgroup: C01 [X(C10H10N2O5)]
dipole: -2.0203218 -1.8092383 -0.0335269 debye
polarizability: 234.5354226|-0.1584656|182.7737529|-1.258986|3.2727093|64.3379487 unknown
InChI: InChI=1S/C10H10N2O5/c1-6(13)11-9-4-3-7(12(15)16)5-8(9)10(14)17-2/h3-5,11H,1-2H3
charge 0 multiplicity 1
27 atoms
O  0.296646 -3.020184 -0.126776
O  -1.875445 -2.212353 -0.096051
O  -2.902781 2.680897 0.053441
O  4.023813 1.999904 -0.019884
O  4.174342 -0.277767 -0.083548
N  -2.198364 0.430247 -0.017375
N  3.493746 0.820988 -0.047782
C  -0.802767 0.554775 -0.024105
C  0.005879 -0.644861 -0.062743
C  1.415587 -0.538948 -0.069946
C  -0.151484 1.826458 0.006404
C  2.019582 0.727126 -0.039673
C  1.245593 1.912165 -0.001448
C  -0.623804 -1.989334 -0.094888
C  -3.17285 1.44809 0.020026
C  -4.598205 0.907972 0.016065
C  -0.259311 -4.396233 -0.161834
H  2.033722 -1.438307 -0.098981
H  -0.770046 2.724381 0.036171
H  1.752195 2.880699 0.021592
H  -2.525777 -0.556473 -0.042585
H  -4.79421 0.31092 -0.893445
H  -5.298964 1.754001 0.048057
H  -4.778429 0.256375 0.890708
H  -0.872678 -4.579716 0.735576
H  0.623488 -5.049103 -0.182501
H  -0.878974 -4.531517 -1.063476
