program: Gaussian 09
title: 000224185
version: EM64L-G09RevD.01
frameworkgroup: C1[X(C20H15ClN2O2)]
method: RPBEPBE
basis: SDD
operation: Freq
keyword: #p
keyword: freq=noraman
keyword: PBEPBE/SDD
title: #p freq=noraman PBEPBE/SDD
converged: YES YES NO NO
title: Mulliken charges:
elementType: Cl O O N N C C C C C C C C C C C C C C C C C C C C H H H H H H H H H H H H H H H
charge: -0.058130 -0.267269 -0.432018 -0.510208 -0.038873 0.239030 0.276042 0.245178 -0.106598 -0.096611 -0.526533 -0.315232 -0.315011 0.302241 -0.293107 0.427745 -0.354815 -0.261490 -0.119881 -0.426436 -0.310411 -0.358535 -0.345090 0.274131 -0.536500 0.307313 0.238129 0.270498 0.265945 0.288571 0.247980 0.257053 0.237033 0.270399 0.221747 0.255579 0.222671 0.224475 0.247523 0.353464
chargesum: 0.00000
title: Mulliken charges with hydrogens summed into heavy atoms:
elementType: Cl O O N N C C C C C C C C C C C C C C C C C C C C
charge: -0.058130 -0.267269 -0.078554 -0.202894 -0.038873 0.239030 0.276042 0.245178 -0.106598 -0.096611 -0.288403 -0.044734 -0.049066 0.302241 -0.004535 0.427745 -0.106835 -0.004437 -0.119881 -0.189402 -0.040012 -0.136787 -0.089511 0.274131 0.158168
polarizability: 4.27985566e+02 1.78788952e-01 3.43332082e+02 -5.84297989e+00 2.39936379e+01 1.37748508e+02
1716.lowfreq: -0.0018 0.0005 0.0008 4.3189 5.3818 8.6496 28.3601 37.3672 40.5429
frequency: 28.3470 37.3015 40.5111 46.4612 81.0866 106.3029 113.0255 118.6194 135.9418 174.2163 201.5538 220.8052 231.0209 254.2574 261.3028 275.2850 292.0710 332.2762 336.5111 347.7860 381.1833 394.7012 408.4474 410.5035 417.1489 439.7275 471.6381 483.0470 502.9269 513.1534 524.7734 539.2877 559.2034 591.5944 611.3661 635.1803 638.7157 649.8180 676.8713 699.1748 714.4967 730.9716 746.6575 763.3504 774.6261 795.4034 810.5126 820.9603 828.9802 829.3874 857.3152 874.4947 890.9344 902.2321 912.6968 951.8322 955.9421 958.0718 968.4510 997.8935 1011.0721 1058.1568 1084.6971 1106.0978 1111.2848 1126.0508 1142.4315 1146.5587 1165.3936 1177.9187 1197.0243 1215.1547 1237.3560 1242.6147 1262.3837 1273.2754 1282.9176 1311.1658 1321.5686 1367.8396 1383.6372 1393.7116 1415.9499 1425.2284 1433.6327 1437.5102 1453.8029 1469.8972 1473.1628 1476.8321 1492.8115 1506.8001 1519.7257 1543.6452 1550.5329 1599.1977 1604.0336 1631.6128 1634.3050 2963.5234 3053.4394 3115.7349 3127.0226 3139.8737 3145.7147 3152.3041 3154.5026 3161.4734 3173.9121 3176.2843 3181.0212 3183.2910 3523.9044 3585.3652
redmass: 6.5322 5.1074 5.5712 4.8573 3.7790 5.0368 5.1074 5.9551 6.4444 5.5158 6.2634 1.5100 4.9380 7.9547 3.2601 3.8817 5.1595 1.1114 5.5089 4.3701 5.6126 6.3742 3.5318 3.0723 4.4871 5.3678 2.9315 3.2296 2.0276 2.5701 6.6132 3.7244 3.3604 6.0837 4.6054 7.3526 6.5292 5.8751 6.5289 4.4561 5.3059 3.3119 6.2752 4.5952 1.9762 1.4434 1.7769 4.3895 1.5907 1.9683 2.4009 3.4848 1.5105 5.1994 1.4109 3.4955 1.5722 1.3555 1.3389 2.7788 3.2964 2.1820 3.6009 1.4546 1.2556 1.6636 1.3576 1.5164 1.3662 1.1029 2.4177 1.6412 2.6045 2.2402 1.7103 2.6192 3.2583 1.6136 2.2199 3.1239 4.6182 4.5374 4.2476 3.5118 2.0351 2.2176 2.4535 1.0516 1.1206 2.5314 2.9131 3.1603 6.7342 8.4689 4.0158 6.0729 5.6518 6.5350 6.8637 1.0328 1.1043 1.0876 1.0995 1.0966 1.0902 1.0869 1.0884 1.0873 1.0973 1.0970 1.0943 1.0959 1.0745 1.0661
irintensity: 0.3556 0.4758 0.7382 0.9659 5.3437 0.2757 1.3410 2.2065 0.8194 1.4380 5.8800 0.1946 1.5918 5.4825 2.0174 2.7265 0.6391 133.1200 5.2610 33.8467 3.3939 10.5712 14.0535 0.6392 1.1045 6.1828 11.6453 74.0878 60.4790 13.0830 22.1378 47.6416 39.6153 1.5176 0.3034 5.8442 4.2357 1.3819 3.9038 4.2570 2.5692 1.5420 33.7808 12.8606 17.3141 26.1066 52.4744 16.3439 41.1236 24.2153 16.3798 32.8401 21.4619 60.9474 1.4404 33.3104 5.8717 4.8915 0.7271 2.8310 60.8092 35.1650 14.5008 110.1800 0.1727 24.8776 223.9865 31.8647 16.1489 7.0128 307.9494 5.9678 59.1636 21.4784 14.7031 6.9708 54.1770 5.3258 5.4723 10.3705 111.5708 48.8056 22.9416 3.5106 70.3833 132.8014 141.8042 13.5405 64.8584 12.4840 32.8715 513.4844 92.1186 88.9407 49.9165 12.1212 18.3758 1.4230 169.1092 109.3780 45.2697 25.4970 25.1416 13.9588 7.8034 3.2369 8.3874 0.5657 17.6952 2.4059 0.6150 5.1091 19.7826 65.7537
temp: 298.150 k
press: 1.00000 atm
elementType: 17 8 8 7 7 6 6 6 6 6 6 6 6 6 6 6 6 6 6 6 6 6 6 6 6 1 1 1 1 1 1 1 1 1 1 1 1 1 1 1
symmnumber: 1
zpe: 785902.9 jmol-1
zpe.correction: 0.299335 hartree
zpe.thermalcorrener: 0.320432 hartree
zpe.thermalcorrenthalpy: 0.321376 hartree
zpe.thermalcorrgfe: 0.248550 hartree
zpe.sumelectzpe: -1489.410780 hartree
zpe.sumelectthermal: -1489.389683 hartree
zpe.sumelectthermalent: -1489.388739 hartree
zpe.sumelectthermalfe: -1489.461564 hartree
dipole: -3.1888 -5.3716 -1.9360
dipole: 6.5399
quadrupole: -121.6200 -150.5180 -152.2711
quadrupole: -10.6471 -8.5082 10.7954
quadrupole: 19.8497 -9.0483 -10.8014 -10.6471 -8.5082 10.7954
hfenergy: -1489.7101146 hartree
pointgroup: C01 [X(C20H15Cl1N2O2)]
dipole: 1.9116504 1.4062 0.9942694 debye
polarizability: 340.3961909|-11.618778|425.9240212|36.5227909|17.9984035|142.7459435 unknown
InChI: InChI=1S/C20H15ClN2O2/c1-25-15-7-9-18-17(11-15)20(22-13-3-5-14(24)6-4-13)16-8-2-12(21)10-19(16)23-18/h2-11,22,24H,1H3
charge 0 multiplicity 1
40 atoms
Cl -4.425617 -3.942935 -0.686643
O  1.05843 4.970787 0.462857
O  4.90455 -3.963974 -0.977438
N  1.200487 -0.086365 0.86338
N  -2.766038 0.952476 -0.462795
C  -0.092878 0.210775 0.397078
C  -0.452646 1.595065 0.221806
C  -1.08965 -0.793409 0.16085
C  -1.818595 1.903603 -0.182518
C  -2.4060 -0.358636 -0.304394
C  0.472038 2.671289 0.407004
C  -0.89077 -2.195107 0.420191
C  -2.197597 3.282201 -0.320504
C  0.064654 4.000997 0.259125
C  -3.41755 -1.348261 -0.578703
C  2.10262 -1.091734 0.408297
C  -1.292623 4.314503 -0.097179
C  -1.891447 -3.13075 0.174088
C  -3.147267 -2.6854 -0.348056
C  3.178312 -1.479178 1.248396
C  1.996011 -1.675591 -0.884773
C  4.13103 -2.423407 0.810338
C  2.932221 -2.631571 -1.315776
C  4.003766 -3.0078 -0.471956
C  0.69746 6.379423 0.276665
H  1.615395 0.619737 1.475047
H  1.530038 2.492305 0.624128
H  0.0624 -2.541118 0.826292
H  -3.232934 3.482785 -0.611719
H  -4.383203 -0.994955 -0.947988
H  -1.614615 5.353961 -0.209207
H  -1.731266 -4.192635 0.380325
H  3.267583 -1.046529 2.251838
H  1.185065 -1.374215 -1.554394
H  4.959036 -2.706092 1.473098
H  2.856362 -3.085578 -2.308063
H  -0.084214 6.695568 0.994135
H  0.357306 6.576413 -0.758253
H  1.62453 6.937534 0.472908
H  5.61722 -4.160481 -0.320387
