program: Gaussian 09
title: 000224163
version: EM64L-G09RevD.01
frameworkgroup: C1[X(C9H10O4)]
method: RPBEPBE
basis: SDD
operation: Freq
keyword: #pfreq=noraman
keyword: PBEPBE/SDD
title: #p freq=noraman PBEPBE/SDD
converged: YES YES NO NO
title: Mulliken charges:
elementType: O O O O C C C C C C C C C H H H H H H H H H H
charge: -0.204149 -0.191090 -0.408436 -0.220666 -0.226136 -0.177063 -0.330992 -0.109111 -0.196835 -0.513473 -0.489173 0.159060 0.127300 0.278635 0.285955 0.307645 0.266984 0.285051 0.229287 0.260197 0.246300 0.234416 0.386295
chargesum: 0.00000
title: Mulliken charges with hydrogens summed into heavy atoms:
elementType: O O O O C C C C C C C C C
charge: -0.204149 -0.191090 -0.022141 -0.220666 0.052499 0.108891 -0.023348 0.157874 0.088216 -0.023989 -0.008457 0.159060 0.127300
polarizability: 1.03663334e+02 5.24783117e-01 1.09617312e+02 2.19404968e+00 9.29942006e-01 7.56004234e+01
1716.lowfreq: -20.1426 -0.0009 -0.0006 -0.0004 4.3694 14.0402 18.9279 88.7130 123.6668
frequency: 16.2813 88.6581 123.6541 176.6951 218.4403 310.4601 355.6190 396.8946 423.2570 478.7601 511.0030 545.4401 558.5037 629.0571 650.8031 653.5325 705.8332 771.5480 797.9892 816.4781 838.6113 865.6104 893.3527 911.2773 931.6312 942.8219 954.4965 966.6511 979.4263 1000.7692 1030.8589 1048.4587 1082.1788 1094.5674 1106.7734 1133.9762 1150.8038 1185.1423 1202.4168 1232.9763 1246.2051 1260.8802 1266.6433 1271.3053 1283.6733 1296.8222 1303.2880 1315.4539 1335.7000 1460.2619 1490.5102 1650.1840 1710.5950 3007.1165 3017.8661 3025.5902 3081.6342 3091.5499 3093.9450 3103.0855 3108.9310 3116.8196 3514.1516
redmass: 10.9597 6.1562 8.3554 4.7373 5.0570 4.0100 4.8106 3.3388 3.4906 2.6294 3.9762 3.4883 4.5164 2.1078 2.5950 5.6068 5.0403 5.1105 3.6263 3.4359 4.2662 2.7046 3.9216 3.4086 2.5971 1.9877 3.2695 1.9031 1.9534 2.0687 1.9277 1.7935 1.7404 2.1382 1.2380 1.6451 1.8610 1.4806 1.7989 1.2578 1.6030 1.5041 1.4406 1.5507 1.4628 1.7053 1.4655 1.5713 1.8891 1.0818 1.0959 9.3003 12.4895 1.0832 1.0614 1.0611 1.1025 1.0938 1.1014 1.0898 1.0889 1.0928 1.0641
irintensity: 2.4883 1.3022 3.6793 0.5182 2.2879 4.9150 4.8549 4.0591 1.9311 13.2270 11.8556 24.3742 21.2933 63.3070 55.4660 1.5815 26.8957 0.6268 11.2131 15.4357 11.1201 4.5739 8.1578 5.3431 17.1006 12.9137 37.9372 9.8164 52.3463 7.2855 82.7469 226.0535 10.3216 10.0541 7.1343 37.8461 20.1290 5.9513 1.4790 8.2580 2.0914 10.9247 2.0258 0.3821 6.2037 16.9651 7.7805 19.2021 15.5908 14.1022 13.7514 208.0136 340.4826 8.6315 24.2427 26.1548 11.4433 11.1220 27.7452 17.4018 21.3463 13.6264 30.1020
temp: 298.150 k
press: 1.00000 atm
elementType: 8 8 8 8 6 6 6 6 6 6 6 6 6 1 1 1 1 1 1 1 1 1 1
symmnumber: 1
zpe: 471531.6 jmol-1
zpe.correction: 0.179597 hartree
zpe.thermalcorrener: 0.189718 hartree
zpe.thermalcorrenthalpy: 0.190662 hartree
zpe.thermalcorrgfe: 0.142501 hartree
zpe.sumelectzpe: -648.893755 hartree
zpe.sumelectthermal: -648.883634 hartree
zpe.sumelectthermalent: -648.882690 hartree
zpe.sumelectthermalfe: -648.930851 hartree
dipole: 1.4904 -3.5740 1.4219
dipole: 4.1251
quadrupole: -81.3236 -82.6034 -70.6743
quadrupole: 16.8552 -0.9421 1.8946
quadrupole: -3.1232 -4.4029 7.5262 16.8552 -0.9421 1.8946
hfenergy: -649.0733518 hartree
pointgroup: C01 [X(C9H10O4)]
dipole: -0.6785829 -1.3880478 -0.4967751 debye
dipolederiv: -0.6214575 0.3863082 -0.0590178 0.0461902 -1.1418639 0.0614538 -0.1452784 0.1143249 -0.3194933 -0.4889914 -0.1624216 -0.0562682 -0.1473448 -1.1939444 -0.0104965 -0.1016166 -0.1280922 -0.327303 -0.3653948 0.2761495 -0.0334425 0.2512258 -1.1147169 0.17293 -0.0472882 0.2119145 -0.4375175 -0.8907081 -0.2804925 0.0809305 -0.0319178 -0.7194267 0.1057282 -0.0682831 0.0698849 -0.3069592 -0.0474599 -0.0445062 -0.0792224 0.0316826 0.0004211 0.0305231 -0.0580994 -0.0155194 0.0904504 0.0475177 0.0044257 -0.0098291 -0.0271512 0.0914306 -0.0176915 0.012061 0.0091775 0.0531291 -0.2395446 -0.1409059 -0.0748063 -0.127445 -0.1295679 -0.0647916 -0.1349229 -0.0355372 0.0655031 0.3289439 0.1346163 -0.0845129 0.0067532 0.6123548 -0.0393083 -0.0301174 0.0791654 0.2518353 -0.2484175 0.0661554 -0.0417409 -0.0395939 0.0138701 0.0369182 -0.157242 0.0167043 0.0613487 0.0599093 -0.0632294 0.0300824 -0.0349778 0.0872238 -0.0049059 0.0134927 -0.0355556 -0.0357682 -0.0311065 -0.0414656 0.0679152 0.0015377 0.028479 0.0050175 0.0611712 0.0384293 -0.0505004 0.9482172 -0.2170789 0.2464232 0.1177742 1.7959904 0.0104447 0.368142 -0.0136152 0.2537412 1.289198 -0.0089404 0.0222259 -0.1409851 1.3917565 -0.2834906 0.2355444 -0.3085691 0.2295852 0.0317965 -0.0016873 0.0821669 0.0049187 0.0619965 0.0236383 0.0795553 0.0059645 -0.1035379 0.0023523 -0.0673731 0.0814713 -0.0521509 0.0383307 0.0519827 0.0760605 0.041805 0.0182967 0.0698291 0.0309223 -0.0428861 0.0222072 0.029193 0.0534464 -0.0386433 0.0415065 0.0292488 -0.0703671 0.0641458 0.0469213 0.0617095 -0.0337441 -0.0139058 0.0518812 -0.025167 0.0631245 0.0518342 -0.0076996 -0.0310949 0.0389173 0.0189684 -0.0716044 0.006602 -0.0637975 -0.0111177 0.0517889 0.0943594 0.0258952 0.0403956 -0.1518316 -0.0510838 0.0185145 -0.0077896 0.078938 -0.0661944 -0.0157905 -0.1090983 0.0347781 0.0765177 0.0373413 -0.0950406 0.0258848 0.0089243 0.0505471 -0.0167369 -0.0378721 -0.0372524 0.0568393 -0.1066703 -0.0349314 -0.0567276 -0.0627814 0.0389498 0.0301798 -0.0025697 0.0646705 -0.154393 0.0665401 0.0053023 0.0198391 0.07808 0.098758 -0.0189345 -0.0216707 -0.0839416 0.3361167 0.0079845 -0.016864 0.0157697 0.3727733 unknown
polarizability: 103.6433103|-0.0600233|109.5063703|1.9791069|-2.5208029|75.7313883 unknown
InChI: InChI=1S/C9H10O4/c10-8(11)6-3-1-4-5(2-3)13-9(12)7(4)6/h3-7,10H,1-2H2
charge 0 multiplicity 1
23 atoms
O  2.430969 0.313524 0.261659
O  1.669982 2.508621 0.106214
O  -2.400485 1.749175 -0.199455
O  -3.161429 -0.388341 0.278986
C  0.790629 -0.778027 -1.18037
C  -0.463583 -1.392048 0.62863
C  0.241198 0.587716 -0.660001
C  1.85411 -1.034378 -0.061575
C  -0.746702 0.134768 0.503792
C  -0.325343 -1.80186 -0.867134
C  0.99951 -1.586603 1.124713
C  1.470014 1.300209 -0.079985
C  -2.210072 0.418503 0.188915
H  1.194531 -0.748008 -2.202552
H  -1.227353 -1.927548 1.210062
H  -0.257978 1.227126 -1.399805
H  2.712326 -1.660215 -0.341847
H  -0.520492 0.683702 1.438966
H  0.000259 -2.848977 -0.995907
H  -1.246234 -1.644015 -1.452842
H  1.237614 -1.054079 2.061671
H  1.203684 -2.660502 1.28276
H  -3.369755 1.916457 -0.354891
