program: Gaussian 09
title: 000224162
version: EM64L-G09RevD.01
frameworkgroup: C1[X(C8H2Br4O4)]
method: RPBEPBE
basis: SDD
operation: Freq
keyword: #p
keyword: freq=noraman
keyword: PBEPBE/SDD
title: #p freq=noraman PBEPBE/SDD
converged: NO YES NO NO
title: Mulliken charges:
elementType: Br Br Br Br O O O O C C C C C C C C H H
charge: 0.117218 0.117276 0.117263 0.117204 -0.366433 -0.366434 -0.170100 -0.170099 0.634408 0.634408 -0.367538 -0.368241 -0.367804 -0.367101 0.006722 0.006723 0.396264 0.396264
chargesum: 0.00000
title: Mulliken charges with hydrogens summed into heavy atoms:
elementType: Br Br Br Br O O O O C C C C C C C C
charge: 0.117218 0.117276 0.117263 0.117204 0.029831 0.029830 -0.170100 -0.170099 0.634408 0.634408 -0.367538 -0.368241 -0.367804 -0.367101 0.006722 0.006723
polarizability: 2.27476708e+02 3.33782448e-02 2.03627833e+02 -5.61630606e-04 2.29611399e+00 8.32890694e+01
1716.lowfreq: -2.6602 0.0002 0.0003 0.0003 5.2657 6.5226 34.6807 45.9757 50.5386
frequency: 34.6806 45.9757 50.5342 53.9843 56.2167 110.8553 124.3013 125.6169 127.1900 128.8119 137.6686 184.3520 201.2452 211.0204 254.6553 266.7479 311.3522 337.3745 439.3853 469.6528 496.8274 502.0893 580.3054 596.8950 612.9423 620.3276 683.6511 701.8723 706.8840 738.0606 765.0115 775.0712 864.3670 1000.9091 1046.5457 1085.7833 1181.8658 1264.4277 1291.1394 1307.6090 1326.2638 1385.8548 1499.4150 1546.3695 1653.9600 1654.4218 3501.1781 3501.2578
redmass: 32.8672 11.0773 10.2617 12.0279 16.9729 12.2601 10.4324 9.9644 76.8234 30.9870 44.7528 10.4510 64.7371 60.1301 20.2129 11.8855 12.3063 11.0825 5.1534 5.3406 10.4645 6.8025 10.5975 4.6162 1.4695 1.2960 9.7775 5.9193 6.3250 11.2379 11.9006 10.8484 11.1182 7.7702 3.4739 3.2051 3.2149 2.2637 11.9936 3.1223 11.9708 9.1107 11.9823 12.0282 10.2989 10.2826 1.0640 1.0640
irintensity: 0.7830 0.8010 0.0001 3.1520 0.0005 2.5755 0.0000 0.6302 0.0003 0.1268 0.0642 0.0000 0.0000 0.0000 0.8387 0.0000 0.0000 0.3204 0.0000 2.4895 0.0000 109.3322 6.1010 0.0018 264.8440 0.0005 17.7242 31.7537 7.8066 0.0002 0.0000 0.0001 0.0000 186.3876 0.0002 569.1083 0.0000 77.0073 225.3325 0.0002 0.3709 74.0638 0.0000 0.0000 0.0057 463.0037 94.7733 0.2887
temp: 298.150 k
press: 1.00000 atm
elementType: 35 35 35 35 8 8 8 8 6 6 6 6 6 6 6 6 1 1
symmnumber: 1
zpe: 218694.9 jmol-1
zpe.correction: 0.083296 hartree
zpe.thermalcorrener: 0.100315 hartree
zpe.thermalcorrenthalpy: 0.101259 hartree
zpe.thermalcorrgfe: 0.033876 hartree
zpe.sumelectzpe: -659.622057 hartree
zpe.sumelectthermal: -659.605039 hartree
zpe.sumelectthermalent: -659.604095 hartree
zpe.sumelectthermalfe: -659.671477 hartree
dipole: -0.0002 0.0000 0.0000
dipole: 0.0002
quadrupole: -119.9994 -110.3818 -136.3789
quadrupole: 0.0301 -0.0339 -15.5030
quadrupole: 2.2540 11.8716 -14.1255 0.0301 -0.0339 -15.5030
hfenergy: -659.7053536 hartree
pointgroup: C01 [X(C8H2Br4O4)]
dipole: 0.0000012 0.0000659 0.0000054 debye
dipolederiv: -0.156843 -0.3040659 0.0021034 -0.258898 -0.4577171 -0.000527 -0.0029679 0.0047396 0.0540276 -0.1565656 0.3033606 0.0019711 0.2584084 -0.4584092 0.0007579 -0.0030839 -0.0044681 0.0540457 -0.1564335 0.3035724 0.0019749 0.258584 -0.4581226 0.0007395 -0.0030825 -0.0045119 0.0540569 -0.1567097 -0.3042767 0.0021054 -0.2590744 -0.4574301 -0.0005101 -0.0029686 0.004778 0.054039 -0.5872614 0.0001177 0.4365838 -0.000017 -0.3525226 0.0002731 0.458984 -0.000098 -0.9950443 -0.5872598 0.0000466 0.4365817 -0.0006432 -0.3525223 0.0020873 0.4589818 0.0004574 -0.9950399 -0.8127397 0.0001472 -0.2830773 -0.000089 -0.2869567 -0.0002643 -0.0061396 0.0000873 -0.8149263 -0.8127377 0.0002928 -0.2830742 -0.0010054 -0.2869538 -0.0011708 -0.0061398 0.0006921 -0.8149246 -0.3761823 -0.0000098 0.026509 0.0002304 -0.3520925 0.0000969 -0.0151887 0.0000852 0.0091828 -0.3761748 -0.0000669 0.0265085 0.0010126 -0.3520934 0.0002132 -0.0151908 0.000101 0.0091847 0.2259159 0.57424 -0.0078304 0.6354103 0.6182632 0.0049667 0.0087041 -0.0062678 -0.0803489 0.2257137 -0.5737885 -0.0075745 -0.6353483 0.618971 -0.0052763 0.0089495 0.0059367 -0.0803873 0.225515 -0.5739084 -0.0076143 -0.6349595 0.6190938 -0.0052314 0.008934 0.0059643 -0.0803916 0.2257111 0.5743609 -0.0078659 0.6350207 0.618388 0.0049258 0.0086974 -0.0062882 -0.0803539 1.4687957 -0.0001918 -0.0824964 0.0001323 0.3280287 -0.0000505 -0.3051767 -0.0000077 1.5523484 1.4687853 0.0004061 -0.082497 0.002137 0.3280263 -0.0010577 -0.3051751 -0.0010978 1.5523416 0.1692347 -0.0000118 -0.0861537 -0.0001436 0.3420256 0.0000186 -0.1440684 0.0000041 0.3010954 0.1692361 -0.0002247 -0.086154 -0.0007573 0.3420239 0.000009 -0.1440688 -0.0001061 0.3010948 unknown
polarizability: 203.6691415|0.0749258|227.4765099|0.5675456|-0.037673|83.2479594 unknown
InChI: InChI=1S/C8H2Br4O4/c9-3-1(7(13)14)4(10)6(12)2(5(3)11)8(15)16/h13,15H
charge 0 multiplicity 1
18 atoms
Br -1.719361 -2.883196 0.000559
Br 1.717212 -2.884531 0.000684
Br -1.717288 2.882999 -0.000594
Br 1.719415 2.881667 -0.000551
O  -3.465475 -0.000222 1.230537
O  3.465463 0.001822 -1.230493
O  -3.613682 -0.000343 -1.093766
O  3.613668 0.001123 1.093808
C  -1.417279 -0.000233 -0.001878
C  1.417269 -0.001243 0.00192
C  -0.707535 -1.225502 0.000445
C  0.706682 -1.226034 0.000074
C  -0.706689 1.224546 -0.000031
C  0.707523 1.224014 -0.000404
C  -2.928537 0.000265 -0.053221
C  2.928528 -0.001696 0.053263
H  -4.461195 -0.000501 1.179639
H  4.461181 0.004169 -1.179592
