program: Gaussian 09
title: 000224226
version: EM64L-G09RevD.01
frameworkgroup: C1[X(C25H21BrSi)]
method: RPBEPBE
basis: SDD
operation: Freq
keyword: #p
keyword: freq=noraman
keyword: PBEPBE/SDD
title: #p freq=noraman PBEPBE/SDD
converged: YES YES NO NO
title: Mulliken charges:
elementType: Br Si C C C C C C C C C C C C C C C C C C C C C C C C C H H H H H H H H H H H H H H H H H H H H H
charge: -0.027706 1.412874 -1.050495 -0.178089 -0.185088 -0.156530 0.612675 -0.307458 -0.321702 -0.324646 -0.278447 -0.300834 -0.317307 -0.420859 -0.326468 -0.240963 -0.251820 -0.238414 -0.252100 -0.243076 -0.255665 -0.233283 -0.233040 -0.234782 -0.224392 -0.243484 -0.239393 0.308359 0.250839 0.259878 0.254949 0.216640 0.254974 0.259137 0.231420 0.269076 0.228451 0.232100 0.228594 0.228582 0.228197 0.231464 0.229126 0.229378 0.229456 0.228469 0.231195 0.230207
chargesum: 0.00000
title: Mulliken charges with hydrogens summed into heavy atoms:
elementType: Br Si C C C C C C C C C C C C C C C C C C C C C C C C C
charge: -0.027706 1.412874 -0.742137 -0.178089 -0.185088 -0.156530 0.612675 -0.056620 -0.061824 -0.069697 -0.061807 -0.045859 -0.058170 -0.189439 -0.057392 -0.012512 -0.019720 -0.009820 -0.023518 -0.014879 -0.024201 -0.004157 -0.003662 -0.005326 0.004078 -0.012289 -0.009186
polarizability: 3.44452476e+02 2.86564481e+01 2.90225255e+02 2.19905949e+01 -2.53580550e+01 2.74638707e+02
1716.lowfreq: -3.9557 0.0004 0.0005 0.0006 4.8439 7.9451 17.9314 22.1057 26.9593
frequency: 16.9541 21.9805 26.8642 32.3918 44.2543 47.5870 48.9990 58.8973 62.1636 70.9990 83.7489 121.0709 150.3218 176.0693 194.8754 199.5512 218.4654 224.2475 232.7783 242.2358 245.3384 378.2054 390.3542 392.3911 396.3829 402.2974 435.0631 449.1993 471.9879 483.4268 499.4817 515.5891 566.6703 591.4180 614.9308 615.9417 616.0799 621.0609 657.7801 685.5334 696.6554 701.1994 704.5230 707.0161 707.4471 711.8926 750.0588 751.4662 752.7942 783.3012 832.0192 853.5858 857.9911 863.0698 868.0463 924.9547 930.5194 932.5205 934.8495 979.2389 980.9846 984.4992 987.1005 987.4279 988.2639 988.8330 989.3637 999.2928 999.5135 1000.8652 1001.9941 1022.4932 1023.7947 1024.0522 1027.3422 1075.4972 1076.9352 1078.1342 1081.8032 1094.5196 1099.6077 1104.7870 1113.0506 1172.2112 1173.8772 1174.0075 1174.1490 1188.3245 1194.4016 1201.2098 1201.4536 1203.6026 1231.9564 1311.5488 1315.4050 1316.6867 1333.1079 1363.1596 1364.2913 1366.1614 1382.2970 1417.8614 1420.0464 1421.0683 1439.8899 1470.2926 1472.0071 1472.8326 1479.6576 1574.9064 1576.0088 1578.2164 1586.2512 1595.8857 1596.5791 1598.6763 1606.1004 3042.9538 3108.2659 3118.2079 3119.2488 3119.6276 3121.3891 3123.0409 3125.1871 3130.4092 3130.9865 3134.0207 3135.8910 3142.9657 3143.4838 3144.2796 3145.3966 3156.8136 3160.0319 3160.2022 3160.7986 3168.2785
redmass: 3.8914 4.7130 6.1627 4.6472 5.3830 5.0919 4.7422 4.3917 4.7615 6.4727 7.4546 8.6529 5.5806 4.6077 5.2616 4.8146 5.2667 5.1358 5.8344 5.0084 4.9772 5.9414 2.7531 2.7839 2.8171 2.8275 5.7977 4.8859 3.9942 4.6196 5.6915 4.7142 5.8462 5.7224 6.4241 6.4485 6.4398 6.2492 5.8079 5.9917 6.4199 1.7637 1.7719 2.0111 2.1810 3.0197 1.7813 1.7162 1.7950 2.1218 4.3034 1.2468 1.2532 1.2463 1.2431 1.3604 1.4160 1.3759 1.3450 1.4019 1.3861 1.4138 6.1994 4.2665 5.8627 1.6318 5.0931 1.3240 1.3188 1.3084 1.3072 3.2874 3.0569 2.9966 2.2106 1.7372 1.6987 1.7260 1.6459 2.4921 2.4848 2.4917 1.2411 1.0703 1.0571 1.0560 1.0571 1.2127 1.1593 1.1651 1.1354 1.1349 2.8873 1.4868 1.4416 1.4738 1.2647 4.1354 4.3128 5.0465 7.5512 2.1433 2.1505 2.1428 2.1989 1.9965 2.0048 2.0090 2.2290 5.4029 5.4731 5.5513 5.8661 5.7559 5.7260 5.8360 5.9587 1.0842 1.0875 1.0846 1.0852 1.0853 1.0863 1.0873 1.0875 1.0875 1.0909 1.0920 1.0923 1.0958 1.0926 1.0961 1.0963 1.0957 1.1016 1.1016 1.1016 1.1004
irintensity: 0.0610 0.1074 0.1761 0.0238 0.2157 0.0284 0.0945 0.1755 0.1553 0.3007 0.5298 0.5792 1.0309 1.2051 1.8639 1.3730 0.4578 0.7843 2.8985 1.1256 0.7093 18.0503 0.1240 0.1279 0.2180 0.5744 10.6289 10.6392 2.3894 33.4486 69.6009 112.8535 19.0211 27.5592 0.9413 0.2474 0.3430 8.3086 3.3528 8.1679 16.0249 29.3606 95.4180 48.5410 26.3349 57.9398 22.8810 10.6932 38.6391 20.9112 7.2549 0.8057 0.2410 0.1107 0.7286 0.0663 1.6652 1.2364 0.3297 0.0884 0.8158 0.0390 2.2770 1.5689 1.7495 0.3410 0.1935 0.3793 0.0819 0.0255 0.0157 0.7918 2.7071 2.9948 5.7376 0.6949 5.5538 1.1917 5.9800 10.0022 47.3827 34.4447 18.3272 0.9987 0.8131 0.2609 0.6210 15.7400 5.5185 2.5374 5.7652 2.2215 4.7435 4.6450 4.5706 3.6555 2.8220 1.6012 2.2085 1.5497 0.3965 14.8551 16.1524 16.2563 11.0850 4.9832 7.4173 11.0981 11.8892 0.8021 0.4695 0.3277 0.4808 0.1067 0.1804 0.0778 1.3566 5.6518 12.0709 1.0240 1.0156 0.1126 3.9211 0.2674 0.3731 1.6716 6.7798 9.9378 5.4036 35.5709 24.9831 28.4783 32.3774 24.3101 48.5514 49.2008 18.9041 18.4253
temp: 298.150 k
press: 1.00000 atm
elementType: 35 14 6 6 6 6 6 6 6 6 6 6 6 6 6 6 6 6 6 6 6 6 6 6 6 6 6 1 1 1 1 1 1 1 1 1 1 1 1 1 1 1 1 1 1 1 1 1
symmnumber: 1
zpe: 987173.4 jmol-1
zpe.correction: 0.375994 hartree
zpe.thermalcorrener: 0.400628 hartree
zpe.thermalcorrenthalpy: 0.401572 hartree
zpe.thermalcorrgfe: 0.316912 hartree
zpe.sumelectzpe: -1266.272786 hartree
zpe.sumelectthermal: -1266.248153 hartree
zpe.sumelectthermalent: -1266.247208 hartree
zpe.sumelectthermalfe: -1266.331869 hartree
dipole: 0.7198 2.2871 1.1618
dipole: 2.6644
quadrupole: -154.6856 -171.4459 -164.0058
quadrupole: 3.4047 3.1613 -11.0688
quadrupole: 8.6935 -8.0668 -0.6267 3.4047 3.1613 -11.0688
hfenergy: -1266.6487807 hartree
pointgroup: C01 [X(C25H21Br1Si1)]
dipole: -0.0861089 0.5866616 -0.8644151 debye
polarizability: 329.9470025|-18.8215324|314.10095|42.3567222|-2.4248717|265.2684852 unknown
InChI: InChI=1S/C25H21BrSi/c26-25(21-13-5-1-6-14-21)27(22-15-7-2-8-16-22,23-17-9-3-10-18-23)24-19-11-4-12-20-24/h1-20,25H
charge 0 multiplicity 1
48 atoms
Br -0.449374 -1.495128 3.00814
Si 0.512665 -0.092658 0.18885
C  -0.718484 0.099106 1.692501
C  2.281796 -0.258095 0.88778
C  0.095965 -1.584502 -0.930299
C  0.372264 1.549586 -0.793068
C  -2.18195 0.271616 1.386077
C  3.220685 -1.150336 0.30231
C  0.18906 -2.91869 -0.438668
C  1.52616 2.352281 -1.014631
C  2.714055 0.545464 1.97921
C  -0.289555 -1.396519 -2.286427
C  -0.870422 2.005244 -1.320404
C  -2.861295 1.426661 1.858767
C  -2.906222 -0.677073 0.612472
C  4.543825 -1.241892 0.793109
C  -0.10692 -4.02252 -1.270001
C  1.444368 3.566038 -1.735678
C  4.033499 0.456419 2.475421
C  -0.581769 -2.499564 -3.121767
C  -0.955349 3.218841 -2.040008
C  4.953486 -0.439632 1.882286
C  -0.495024 -3.816232 -2.614697
C  0.20242 4.003637 -2.249707
C  -4.223333 1.641271 1.552005
C  -4.268366 -0.467337 0.313645
C  -4.932066 0.694296 0.777712
H  -0.360049 0.943462 2.307893
H  2.918234 -1.781583 -0.541936
H  0.4879 -3.098769 0.600478
H  2.49748 2.027254 -0.623363
H  2.018031 1.246617 2.45768
H  -0.353289 -0.382979 -2.699168
H  -1.783238 1.417435 -1.167134
H  -2.316908 2.161253 2.464481
H  -2.402208 -1.583318 0.261805
H  5.250314 -1.938536 0.327408
H  -0.032535 -5.039748 -0.868889
H  2.347523 4.166353 -1.894923
H  4.341663 1.080352 3.322106
H  -0.874549 -2.329922 -4.164305
H  -1.923171 3.549959 -2.433682
H  5.977461 -0.512131 2.266459
H  -0.722477 -4.67225 -3.260487
H  0.137096 4.944827 -2.807776
H  -4.729992 2.539711 1.921588
H  -4.813994 -1.209824 -0.279282
H  -5.99072 0.854457 0.544715
