program: Gaussian 09
title: 000224159
version: EM64L-G09RevD.01
frameworkgroup: C1[X(C6H6Cl4O2)]
method: RPBEPBE
basis: SDD
operation: Freq
keyword: #p
keyword: freq=noraman
keyword: PBEPBE/SDD
title: #p freq=noraman PBEPBE/SDD
converged: YES YES NO NO
title: Mulliken charges:
elementType: Cl Cl Cl Cl O O C C C C C C H H H H H H
charge: 0.016657 0.016668 -0.056288 -0.056308 -0.042282 -0.042272 -0.340835 -0.340795 -0.457185 -0.457210 0.025233 0.025239 0.275015 0.254153 0.275012 0.254144 0.325525 0.325530
chargesum: 0.00000
title: Mulliken charges with hydrogens summed into heavy atoms:
elementType: Cl Cl Cl Cl O O C C C C C C
charge: 0.016657 0.016668 -0.056288 -0.056308 -0.042282 -0.042272 0.188332 0.188361 -0.131660 -0.131680 0.025233 0.025239
polarizability: 1.00484009e+02 -3.73890673e+00 1.41941018e+02 -2.35513907e-03 1.81051839e-04 8.09422442e+01
1716.lowfreq: -10.0507 -6.1326 -0.0033 -0.0013 -0.0012 2.9790 16.0328 20.2135 21.1127
frequency: 16.0279 20.1826 21.0705 46.2132 62.2457 137.0387 142.5965 165.3416 196.4523 219.6730 231.3894 268.8484 271.3757 383.6561 393.2591 395.3338 401.4747 595.6860 606.1426 670.7662 671.7001 706.9261 740.7547 810.9596 888.8363 910.8947 1017.4431 1025.7136 1065.6069 1075.0295 1155.8025 1206.6500 1227.1852 1263.8124 1307.2749 1319.1068 1328.1989 1359.8307 1457.2838 1468.7331 1759.8726 1762.8708 3012.1673 3019.7432 3069.0380 3089.6491 3121.5748 3123.1007
redmass: 21.8327 21.2609 21.5046 9.3254 14.8203 7.4901 3.1867 25.1925 9.0779 3.9716 5.4390 17.6803 5.5626 5.5810 15.8948 11.7163 6.0380 9.2439 8.9456 2.7200 5.7792 5.2721 7.2097 1.7262 4.0821 3.7553 2.7428 3.9870 2.6111 2.9979 1.1950 1.0975 1.1644 1.2731 1.2809 1.2844 1.1436 1.3555 1.0731 1.0921 11.4522 11.2751 1.0612 1.0590 1.1031 1.1029 1.0887 1.0896
irintensity: 0.0527 0.2365 0.1247 1.5959 0.8002 2.1967 5.0674 0.1043 4.4286 0.7727 0.6276 0.0001 14.3478 0.6484 23.5202 10.2228 23.2657 1.3478 66.4554 1.1566 233.3876 17.8277 1.8130 3.3622 164.3155 4.8052 36.4845 1.5059 18.4067 2.7732 5.3860 3.0368 8.5363 8.2705 17.4705 0.2481 3.5662 3.0285 3.6183 18.1403 131.2333 252.1943 0.2754 7.3121 0.1320 7.3174 0.8284 1.6509
temp: 298.150 k
press: 1.00000 atm
elementType: 17 17 17 17 8 8 6 6 6 6 6 6 1 1 1 1 1 1
symmnumber: 1
zpe: 294344.4 jmol-1
zpe.correction: 0.112110 hartree
zpe.thermalcorrener: 0.126231 hartree
zpe.thermalcorrenthalpy: 0.127176 hartree
zpe.thermalcorrgfe: 0.065483 hartree
zpe.sumelectzpe: -2222.000774 hartree
zpe.sumelectthermal: -2221.986653 hartree
zpe.sumelectthermalent: -2221.985709 hartree
zpe.sumelectthermalfe: -2222.047401 hartree
dipole: 0.0001 -0.0001 -3.6853
dipole: 3.6853
quadrupole: -110.9658 -104.7258 -101.1150
quadrupole: 0.2893 0.0005 0.0000
quadrupole: -5.3636 0.8764 4.4872 0.2893 0.0005 0.0000
hfenergy: -2222.1128842 hartree
pointgroup: C01[X(C6H6Cl4O2)]
dipole: -0.0013249 0.00124 -1.4499152 debye
dipolederiv: -0.323063 0.1453477 0.0155011 0.2053027 -0.4507621 -0.0846863 0.0004192 -0.0722312 -0.1392726 -0.3230355 0.1454782 -0.0149085 0.2054248 -0.4510739 0.08377 0.0002872 0.0714153 -0.1389634 -0.2213027 -0.2525165 0.0134576 -0.2643756 -0.931364 0.176525 0.0262961 0.1691423 -0.2498888 -0.2214034 -0.2528227 -0.013942 -0.2646387 -0.930769 -0.1772002 -0.0267924 -0.1698479 -0.2504206 -0.2393645 -0.0390054 -0.1065713 -0.1202275 -0.5821392 0.1477969 -0.0519127 0.4087356 -0.8068162 -0.2390581 -0.0398557 0.1055575 -0.1205728 -0.5812025 -0.147225 0.0507342 -0.4082863 -0.808034 -0.0195393 0.0916266 0.0387896 -0.0074396 -0.0388417 -0.0313278 -0.0446995 -0.0495757 0.0460039 -0.0194496 0.0917725 -0.0385167 -0.0075189 -0.0389467 0.0312031 0.0448124 0.0492533 0.0461387 0.3565435 -0.3250742 -0.1240313 -0.2879494 0.4560921 0.0611071 -0.0467613 0.0895795 0.1033724 0.3567117 -0.3253754 0.123019 -0.288095 0.4564334 -0.0600101 0.045843 -0.0883688 0.1027775 0.3147821 0.387737 0.1555518 0.5111564 1.5191386 -0.2931131 0.0966419 -0.5348491 1.0331534 0.3143372 0.3889018 -0.1536691 0.5118573 1.5176994 0.293061 -0.094588 0.5349896 1.0350212 0.0665363 0.0119166 0.0113761 -0.014747 0.0376548 0.043874 0.0371921 0.0617535 -0.0175438 0.0265327 -0.0593025 -0.0704687 -0.0227576 0.0415809 -0.0630956 -0.0264197 -0.0572733 0.0058151 0.0664311 0.0118142 -0.0115156 -0.0147743 0.037818 -0.0437561 -0.0373747 -0.06168 -0.0176309 0.026695 -0.0593156 0.070336 -0.0226865 0.0413779 0.0631963 0.0263484 0.0574457 0.0058232 0.0388396 0.0393318 0.0136664 0.0010672 -0.0513846 0.044345 0.0067902 -0.0005604 0.0252442 0.0388068 0.0393416 -0.0136319 0.0009746 -0.0513114 -0.044464 -0.0068164 0.0003577 0.0252207 unknown
polarizability: 100.3032184|-2.5401776|142.1217363|-0.0227741|0.0559577|80.9423168 unknown
InChI: InChI=1S/C6H6Cl4O2/c7-3(5(9)11)1-2-4(8)6(10)12/h3-4H,1-2H2
charge 0 multiplicity 1
18 atoms
Cl 2.703171 -2.208657 -0.86658
Cl -2.703981 2.209852 -0.857709
Cl 2.957082 2.023523 -0.088363
Cl -2.956806 -2.02373 -0.086363
O  2.677684 -0.142318 1.573293
O  -2.674527 0.139313 1.578464
C  0.375322 -0.679818 -0.601438
C  -0.375872 0.680302 -0.599607
C  1.899716 -0.499972 -0.761803
C  -1.900608 0.500882 -0.757402
C  2.512094 0.236701 0.425927
C  -2.510856 -0.237777 0.430191
H  0.179228 -1.247526 0.325535
H  0.033357 -1.305559 -1.446131
H  -0.178014 1.246488 0.327929
H  -0.035463 1.30742 -1.443907
H  2.165776 0.001343 -1.701585
H  -2.168502 0.001232 -1.697552
