program: Gaussian 09
title: 000224184
version: EM64L-G09RevD.01
frameworkgroup: C1[X(C16H20ClNO5)]
method: RPBEPBE
basis: SDD
operation: Freq
keyword: #p
keyword: freq=noraman
keyword: PBEPBE/SDD
title: #p freq=noraman PBEPBE/SDD
converged: YES YES NO NO
title: Mulliken charges:
elementType: Cl O O O O O N C C C C C C C C C C C C C C C C H H H H H H H H H H H H H H H H H H H H
charge: -0.065472 -0.294518 -0.244776 -0.222721 -0.225542 -0.276862 -0.425617 0.139462 -0.644529 0.528356 0.199029 0.254056 -0.388102 -0.405888 0.253872 -0.222051 -0.224962 -0.255928 -0.254609 -0.109141 -0.787174 -0.655510 -0.664786 0.277166 0.267469 0.351237 0.252962 0.259402 0.253927 0.253853 0.239649 0.228925 0.240668 0.227000 0.220870 0.252075 0.259050 0.222282 0.233560 0.252100 0.249141 0.233700 0.218380
chargesum: 0.00000
title: Mulliken charges with hydrogens summed into heavy atoms:
elementType: Cl O O O O O N C C C C C C C C C C C C C C C C
charge: -0.065472 -0.294518 -0.244776 -0.222721 -0.225542 -0.276862 -0.074380 0.139462 -0.099895 0.528356 0.199029 0.254056 -0.135139 -0.146487 0.253872 0.031876 0.028891 0.212646 0.213059 -0.109141 -0.055179 0.052431 0.036434
polarizability: 2.48045527e+02 9.42157177e+00 1.92425393e+02 1.71689397e+01 -1.27400749e+01 1.69288961e+02
1716.lowfreq: -5.5521 -0.0019 -0.0018 0.0008 3.6772 7.4728 17.3066 26.8410 28.7277
frequency: 16.9638 26.6569 28.6820 44.7130 47.3254 50.8661 54.8629 62.2413 76.4037 90.2790 100.7229 101.9746 106.7929 125.5128 141.5485 165.1512 188.7295 197.5411 215.7774 245.5839 268.3191 288.7314 291.8715 305.3851 315.7511 345.8798 354.1617 384.7397 402.4102 413.0410 421.9170 441.1675 483.1888 518.3873 555.8572 573.7682 606.2831 621.8576 627.2933 630.6034 662.3244 707.6854 727.4084 740.5754 775.5102 794.0220 805.8921 817.1452 820.9535 834.7927 836.4386 849.5509 890.0235 939.7569 956.2909 972.9262 976.4647 1000.8286 1001.4515 1003.7475 1013.4513 1029.7552 1041.1256 1071.7109 1094.4621 1097.4050 1105.7752 1129.3194 1152.4565 1156.3631 1156.6248 1160.8981 1186.3075 1219.0414 1251.4445 1274.3899 1275.4617 1279.7392 1300.4074 1317.0261 1352.8140 1354.2034 1377.7263 1384.9179 1392.2269 1394.3331 1398.4646 1446.0308 1457.3880 1458.5253 1462.0538 1463.1019 1464.0302 1467.5887 1477.3092 1479.0099 1483.5079 1484.2733 1585.9421 1600.7407 1605.0712 1630.1191 1639.1523 2995.2595 2996.3083 2997.0564 3035.9217 3037.5216 3043.8944 3090.3397 3090.6597 3092.8707 3098.3193 3099.7976 3110.2290 3112.5574 3124.9881 3126.1994 3134.6862 3137.5995 3166.2805 3169.6796 3545.1906
redmass: 5.3301 4.1045 5.4325 3.0648 3.9429 2.0173 1.6361 3.0980 5.1411 3.3837 5.7205 5.2380 4.5419 4.1304 6.4304 3.9432 6.8916 1.3512 1.4452 3.4785 3.5781 4.9819 3.3013 3.0310 4.9055 5.7017 5.0337 2.2636 7.4338 2.9532 3.6524 3.6059 3.6996 4.2157 3.3389 3.5675 4.1493 1.9292 6.8291 3.1389 3.9324 4.3665 3.9047 3.1326 3.3014 2.0741 2.5829 1.6463 1.8468 2.8839 1.3044 2.0899 3.0071 3.1885 1.3785 1.5936 2.0425 3.8236 2.1649 2.4307 3.4638 3.4171 1.6706 2.6834 2.2357 2.1524 1.5930 2.5160 5.4879 1.8189 1.6943 3.1438 1.1467 2.7441 1.7526 1.2633 1.1261 1.7079 1.2975 1.4382 1.2730 1.2781 6.9690 1.2363 1.2332 1.2271 2.4965 1.1154 1.0942 1.0940 1.0490 1.0932 1.0930 1.1266 1.8153 2.2255 1.0532 1.0544 7.2620 6.1937 6.5732 9.7050 10.1801 1.0362 1.0364 1.0363 1.0597 1.0596 1.0598 1.0987 1.0972 1.0974 1.1029 1.1031 1.1038 1.0997 1.1067 1.1068 1.0898 1.0897 1.0953 1.0964 1.0782
irintensity: 2.4157 2.6203 0.6557 1.9709 0.2598 0.7233 0.1687 1.4640 7.4690 4.2941 3.3722 0.9654 0.6671 2.5145 1.2695 2.5476 1.1443 0.5849 2.5355 3.3079 1.0809 3.3631 10.2102 6.2922 1.5587 10.9313 3.8628 2.3939 23.9625 0.1524 3.4652 0.7307 10.6198 35.8115 14.3414 25.0609 45.3925 6.8385 0.2073 16.8238 48.9515 2.4538 20.9483 4.4691 16.8786 11.9052 19.1995 1.7395 10.2477 19.4946 0.7910 21.6064 5.7563 8.9278 1.1313 4.9028 7.5294 36.5201 22.3429 5.5081 89.8411 107.8516 15.8213 34.5635 114.8292 3.1856 53.9271 251.4917 124.0097 26.5024 22.9584 165.5377 1.8032 2.6031 33.2838 7.7360 6.4468 24.6321 0.2769 14.6822 1.2265 1.8556 1.5578 62.1025 22.2644 30.9195 2.7324 76.5506 29.5347 2.6897 12.8040 52.7128 59.8948 20.0462 171.0482 98.9209 13.5401 22.1998 0.8391 9.6236 147.8912 181.5647 74.8857 18.2448 7.4017 15.1847 27.6397 20.7251 3.7241 12.0605 36.8309 26.8896 1.4106 1.4385 0.5662 10.6881 26.6740 22.6085 4.1203 6.4850 6.5729 0.6072 71.8851
temp: 298.150 k
press: 1.00000 atm
elementType: 17 8 8 8 8 8 7 6 6 6 6 6 6 6 6 6 6 6 6 6 6 6 6 1 1 1 1 1 1 1 1 1 1 1 1 1 1 1 1 1 1 1 1
symmnumber: 1
zpe: 881825.9 jmol-1
zpe.correction: 0.335870 hartree
zpe.thermalcorrener: 0.361046 hartree
zpe.thermalcorrenthalpy: 0.361991 hartree
zpe.thermalcorrgfe: 0.277046 hartree
zpe.sumelectzpe: -1510.924419 hartree
zpe.sumelectthermal: -1510.899242 hartree
zpe.sumelectthermalent: -1510.898298 hartree
zpe.sumelectthermalfe: -1510.983243 hartree
dipole: -1.4017 3.0357 1.7111
dipole: 3.7561
quadrupole: -151.6875 -136.1816 -132.0614
quadrupole: -3.7341 10.2153 3.6378
quadrupole: -11.7106 3.7952 7.9155 -3.7341 10.2153 3.6378
hfenergy: -1511.2602883 hartree
pointgroup: C01 [X(C16H20Cl1N1O5)]
dipole: -0.2244881 1.4492546 0.1816981 debye
polarizability: 251.9714257|-2.1074356|176.8918569|4.3312904|-19.4197472|180.8965977 unknown
InChI: InChI=1S/C16H20ClNO5/c1-4-22-14(20)16(18-11(3)19,15(21)23-5-2)10-12-6-8-13(17)9-7-12/h6-9,18H,4-5,10H2,1-3H3
charge 0 multiplicity 1
43 atoms
Cl 6.085689 -1.394765 -0.718968
O  0.374781 2.097873 0.498194
O  -2.746019 -0.748643 -0.949958
O  -0.480003 1.63677 -1.620003
O  -2.931591 0.500337 1.009026
O  -1.336523 -2.179741 1.913407
N  -0.217548 -0.18413 1.54178
C  -0.670563 -0.078931 0.150786
C  -0.082159 -1.206023 -0.774706
C  1.435685 -1.254713 -0.766024
C  -0.265955 1.296899 -0.437192
C  -2.242242 -0.084316 0.146678
C  2.12951 -2.055327 0.178209
C  2.195189 -0.507391 -1.704174
C  -0.618545 -1.226919 2.354624
C  3.541324 -2.104762 0.201425
C  3.607934 -0.54252 -1.698062
C  0.783906 3.471958 0.049091
C  -4.240446 -0.771398 -1.085884
C  4.258587 -1.339732 -0.737794
C  -0.166404 -1.144242 3.805839
C  -0.376874 4.453583 0.21599
C  -4.735371 0.49787 -1.782208
H  -0.511802 -2.154846 -0.414607
H  -0.467771 -1.018482 -1.789509
H  0.302022 0.611542 1.917547
H  1.560342 -2.660219 0.893263
H  1.678132 0.101111 -2.45527
H  4.070312 -2.72903 0.927418
H  4.187423 0.029364 -2.428656
H  1.114471 3.402427 -1.00152
H  1.63673 3.709663 0.703921
H  -4.675347 -0.88366 -0.077685
H  -4.424466 -1.677216 -1.684425
H  0.661683 -0.432138 3.964265
H  0.144799 -2.145003 4.146489
H  -1.02323 -0.832947 4.430272
H  -0.036464 5.472941 -0.043844
H  -0.740836 4.464883 1.257275
H  -1.21383 4.190381 -0.451807
H  -4.546626 1.387174 -1.15832
H  -4.237124 0.632371 -2.757405
H  -5.824881 0.422448 -1.955778
