program: Gaussian 09
title: 000224133
version: EM64L-G09RevD.01
frameworkgroup: C1[X(C14H10N2)]
method: RPBEPBE
basis: SDD
operation: Freq
keyword: #pfreq=noraman
keyword: PBEPBE/SDD
title: #p freq=noraman PBEPBE/SDD
converged: YES YES NO NO
title: Mulliken charges:
elementType: N N C C C C C C C C C C C C C C H H H H H H H H H H
charge: -0.591535 -0.000062 -0.052262 0.284110 0.215451 0.175496 0.161931 -0.418232 -0.391044 -0.390580 -0.391874 -0.183868 -0.234328 -0.230308 -0.229540 -0.229101 0.250002 0.272290 0.242251 0.242671 0.289452 0.285230 0.231302 0.232047 0.230434 0.230065
chargesum: 0.00000
title: Mulliken charges with hydrogens summed into heavy atoms:
elementType: N N C C C C C C C C C C C C C C
charge: -0.016853 -0.000062 -0.052262 0.284110 0.215451 0.175496 0.161931 -0.168230 -0.118753 -0.148329 -0.149203 -0.183868 -0.003026 0.001740 0.000894 0.000964
polarizability: 2.20699538e+02 3.50098811e-01 1.72992177e+02 -7.03224309e-01 3.27846825e+00 8.47321844e+01
1716.lowfreq: -9.0462 -7.7575 -0.0007 -0.0005 -0.0003 1.7268 60.6083 90.3055 102.5694
frequency: 60.5961 90.3053 102.5680 141.5473 171.3835 206.7899 212.0310 250.7507 301.5022 342.9149 399.1257 407.4830 424.5371 457.0325 493.9303 507.1732 531.7215 565.2860 579.2872 615.5756 617.2055 650.4332 693.2497 739.5518 752.6426 760.9233 772.7680 791.7548 862.7362 878.9765 884.6805 945.9815 953.4963 958.3989 988.6413 991.9581 995.9328 1019.6979 1029.3264 1068.3477 1101.9559 1114.4629 1158.1332 1163.1512 1175.5270 1177.6266 1233.2072 1263.6897 1289.5447 1303.8213 1374.4086 1405.5587 1437.7716 1443.2433 1462.9744 1484.2803 1594.6402 1596.7190 1613.2429 1616.3817 1629.6811 2188.0237 3123.9981 3128.9663 3131.6086 3141.3727 3145.6986 3153.9064 3164.6894 3168.2522 3450.5153 3590.5095
redmass: 4.8460 7.4150 5.3597 4.0737 3.2639 2.7289 4.6141 1.4407 4.0463 3.5100 6.7456 5.5671 3.1511 7.1603 3.0332 5.4748 4.1135 2.8144 2.0409 6.9045 4.7478 5.4635 5.8346 3.0963 3.3504 1.6050 1.7217 2.4314 4.5027 1.3749 1.4830 1.8786 1.7580 1.8001 1.3387 1.3368 6.1334 2.2528 2.1143 2.8938 2.0224 2.2339 1.8405 2.0039 1.2459 1.2233 1.9181 1.8328 1.6255 1.9594 9.4764 3.4630 2.2227 2.8301 2.5491 4.0032 6.8213 6.9389 5.3680 5.1159 1.2357 12.6575 1.0870 1.0863 1.0887 1.0902 1.0941 1.0949 1.1002 1.1002 1.0444 1.0991
irintensity: 3.1477 3.1911 2.1994 0.2449 4.5948 6.8061 1.2130 42.6894 1.9458 4.3746 0.4461 0.4448 12.7447 1.1397 22.9409 0.1454 15.3523 34.4595 129.8279 7.8723 19.3511 29.1936 2.7807 44.9580 39.7084 0.2407 86.9249 0.7629 15.8851 0.4252 0.0480 10.2714 4.1467 4.5927 0.0197 0.0736 2.4193 1.2934 5.1675 7.6229 2.5674 10.1726 6.0876 13.3743 3.1733 1.5537 4.3256 7.9764 7.8757 1.1013 3.3855 1.1561 34.9860 9.7986 6.3405 0.4112 0.7460 0.9942 11.3735 5.6815 30.2458 6.7257 3.7777 3.0796 1.5564 6.2009 19.3331 19.4099 35.9730 21.3289 5.9219 3.8715
temp: 298.150 k
press: 1.00000 atm
elementType: 7 7 6 6 6 6 6 6 6 6 6 6 6 6 6 6 1 1 1 1 1 1 1 1 1 1
symmnumber: 1
zpe: 521845.8 jmol-1
zpe.correction: 0.198761 hartree
zpe.thermalcorrener: 0.211427 hartree
zpe.thermalcorrenthalpy: 0.212371 hartree
zpe.thermalcorrgfe: 0.160038 hartree
zpe.sumelectzpe: -647.900678 hartree
zpe.sumelectthermal: -647.888012 hartree
zpe.sumelectthermalent: -647.887068 hartree
zpe.sumelectthermalfe: -647.939401 hartree
dipole: 0.7925 -3.4755 3.1127
dipole: 4.7324
quadrupole: -76.9860 -93.7550 -98.4003
quadrupole: 3.2368 1.8474 11.3434
quadrupole: 12.7278 -4.0412 -8.6866 3.2368 1.8474 11.3434
hfenergy: -648.0994387 hartree
pointgroup: C01 [X(C14H10N2)]
dipole: -0.321116 -1.4432667 -1.1315823 debye
dipolederiv: -0.5101577 -0.2309976 0.0673168 -0.2281138 -0.5844492 0.1586477 0.073954 0.1616361 -0.4934427 -0.1852725 0.0149326 -0.0000112 0.00025 -0.3074595 -0.0012596 -0.0004755 -0.1027148 -0.2062328 0.4551556 0.0979235 0.0535507 0.0886552 0.4691355 -0.101735 -0.0135816 -0.1041718 0.6769193 -0.1780351 0.0535634 0.0441112 0.1754015 -0.0390182 0.0129517 -0.0199266 -0.0330149 -0.1951103 -0.1506525 -0.0880369 -0.0375393 -0.1767893 -0.0131837 0.0050073 0.0003919 -0.0456394 -0.1528751 0.2574663 0.0237056 -0.010819 -0.0492647 -0.049276 0.0333372 -0.0062638 -0.0101449 0.0105253 0.2410094 -0.0326068 0.024102 0.0160109 -0.0169007 0.0059732 0.0214855 0.0033374 0.0114408 0.022718 -0.0797136 0.0239881 -0.1353295 0.0414635 -0.0303228 0.0084741 -0.0204761 -0.1301774 0.0174217 0.0343867 -0.0000548 0.1318872 0.0566153 -0.0503562 -0.0142426 -0.0435126 -0.1016401 -0.1146525 -0.0588279 0.0131438 -0.0488501 0.0709631 -0.0446927 0.0047971 -0.0490634 -0.1217148 -0.1428478 0.065797 -0.0185488 0.0510929 0.0637808 -0.0465505 -0.0202817 -0.0419593 -0.133811 -0.1209424 -0.0393373 -0.0182237 0.0064374 0.0668004 0.0313616 -0.0135839 0.207197 -0.0417459 -0.0012957 -0.0149755 -0.0012786 -0.0863854 -0.0383563 -0.0271401 0.0056277 -0.0229914 -0.1443063 0.006703 0.0293787 -0.0087621 0.0760705 -0.0621446 -0.0195378 -0.0203353 -0.0128657 -0.1545839 0.0002149 0.0738496 -0.0156299 0.1678622 0.0221031 -0.0313531 -0.0335113 -0.0367243 -0.1414623 0.0253061 -0.080562 0.017016 -0.1631703 0.038181 -0.0412878 0.0383513 -0.0418751 -0.1344425 0.078923 0.0291824 -0.0021609 0.0789232 -0.0658455 0.0384554 -0.0129803 0.0377316 0.1329812 0.0916369 -0.0266906 0.0055349 -0.0581659 -0.0247405 0.0342036 0.0177824 0.0299002 0.1385572 0.0704919 0.0797308 -0.0172785 0.0415799 -0.0704404 0.0441014 -0.0067038 0.0477778 0.1417846 0.0707385 -0.0781611 0.0186654 -0.0395164 -0.0676686 0.0455462 0.0083474 0.0489386 0.1429176 0.0981927 0.2046024 -0.0521867 0.1060624 0.2775616 -0.021436 -0.0102024 0.0188596 0.1494893 0.2806094 0.0229092 -0.0913818 0.0426164 0.1132736 -0.0947503 -0.0158165 -0.0963584 0.1375715 -0.1291367 0.0219843 -0.0058431 0.0337496 0.0815138 0.0138133 -0.0032579 0.0180168 0.1561729 -0.1250505 -0.0233043 0.0120392 -0.0329948 0.0820266 0.0164075 0.0103704 0.0179213 0.1558418 -0.0281106 -0.1020355 0.0194711 -0.1178809 -0.0227988 0.0349229 0.023476 0.0353134 0.1492802 -0.0304333 0.103303 -0.0192205 0.1198618 -0.0211363 0.0356927 -0.0218946 0.0348825 0.1480635 unknown
polarizability: 220.6754604|-0.4312523|172.210786|-1.949875|-8.8874553|85.5376532 unknown
InChI: InChI=1S/C14H10N2/c15-9-14(16)12-7-3-1-5-10(12)11-6-2-4-8-13(11)14/h1-8H,16H2
charge 0 multiplicity 1
26 atoms
N  0.068569 1.903361 -1.742335
N  -0.062168 3.188975 1.441474
C  -0.018465 1.253479 -0.414297
C  -1.221402 0.292406 -0.183938
C  1.177527 0.29813 -0.204464
C  -0.756209 -1.026204 0.084636
C  0.722684 -1.019277 0.080734
C  -2.59248 0.583755 -0.23764
C  2.542627 0.602553 -0.293751
C  -1.677283 -2.074283 0.29404
C  1.65611 -2.056307 0.291957
C  -0.03279 2.328303 0.616165
C  -3.518446 -0.470443 -0.029987
C  3.47931 -0.441423 -0.083658
C  -3.062068 -1.786043 0.23263
C  3.03711 -1.75581 0.208995
H  -2.948796 1.603927 -0.422267
H  2.870213 1.621624 -0.522439
H  -1.334669 -3.093438 0.504459
H  1.325456 -3.07636 0.51602
H  -0.691327 2.563229 -1.93827
H  0.225365 1.232596 -2.501303
H  -4.594093 -0.26633 -0.06564
H  4.552524 -0.231283 -0.145114
H  -3.791363 -2.587527 0.394321
H  3.775266 -2.549009 0.372071
