program: Gaussian 09
title: 000224125
version: EM64L-G09RevD.01
frameworkgroup: C1[X(C17H19NO)]
method: RPBEPBE
basis: SDD
operation: Freq
keyword: #p
keyword: freq=noraman
keyword: PBEPBE/SDD
title: #p freq=noraman PBEPBE/SDD
converged: YES YES NO NO
title: Mulliken charges:
elementType: O N C C C C C C C C C C C C C C C C C H H H H H H H H H H H H H H H H H H H
charge: -0.437932 -0.169325 -0.342510 0.224310 0.184877 0.189284 0.189677 0.485947 -0.587419 -0.426907 -0.390186 -0.405132 -0.404182 -0.396554 -0.395586 -0.242419 -0.230685 -0.663690 -0.663794 0.245990 0.259884 0.233571 0.226740 0.255127 0.236615 0.221203 0.224204 0.220905 0.228532 0.337606 0.224590 0.222226 0.239682 0.217022 0.213816 0.244766 0.214673 0.215075
chargesum: 0.00000
title: Mulliken charges with hydrogens summed into heavy atoms:
elementType: O N C C C C C C C C C C C C C C C C C
charge: -0.100326 -0.169325 -0.096520 0.224310 0.184877 0.189284 0.189677 0.485947 -0.327535 -0.193336 -0.163446 -0.150005 -0.167567 0.048853 0.053851 -0.017828 -0.008459 0.006830 0.010720
polarizability: 3.49263030e+02 -5.32691197e+00 1.93483336e+02 2.45540681e-01 1.24701024e+01 1.07368006e+02
1716.lowfreq: -5.5502 -0.0005 0.0003 0.0004 5.0293 9.6535 42.1927 43.5184 79.7539
frequency: 42.1654 43.5003 79.7528 86.2245 91.3139 119.8154 135.6599 159.0729 168.3185 202.9531 208.8637 231.1648 267.5598 300.8049 322.2445 345.9809 357.5034 379.2255 405.3295 436.3322 455.8548 475.5029 512.4336 530.4628 544.9350 561.3981 591.5938 611.5920 655.0118 686.5609 719.6834 743.2228 756.3944 773.7226 786.7820 790.1418 812.1937 818.0262 848.2351 869.2307 878.3041 919.1291 935.7865 941.2938 946.3521 964.5503 981.7942 991.5394 1016.8686 1027.9530 1072.4831 1076.8949 1094.8128 1095.7250 1120.2512 1147.6896 1165.5264 1178.8881 1188.6899 1197.8547 1203.6018 1204.5028 1239.8739 1270.3797 1286.1766 1297.1167 1305.2643 1340.5474 1350.7778 1355.3100 1364.6968 1386.3520 1387.8624 1389.9570 1395.7893 1445.4317 1458.0587 1466.1371 1467.9035 1469.2316 1478.0403 1481.9447 1492.2939 1495.4735 1514.8252 1580.9687 1592.8789 1616.6765 1634.8635 2983.0592 2983.2488 2986.1600 2992.2446 3022.0958 3035.5232 3041.0515 3078.6956 3078.8336 3091.8602 3093.1275 3120.6885 3125.2756 3131.6771 3142.9998 3157.9021 3160.5039 3164.9518 3545.7258
redmass: 4.1840 3.7643 3.3285 3.1662 3.5545 4.5838 3.2411 2.9600 4.0672 1.6369 1.0371 2.1403 3.4818 2.7920 3.5233 3.5081 1.3039 3.7792 3.2718 2.9479 3.0658 3.4716 3.8600 4.4169 3.5388 3.8061 3.8411 4.6532 4.9158 4.2708 4.9817 1.7140 4.1252 1.9549 1.1346 1.3794 1.6173 3.0028 2.4209 1.6290 1.5023 2.2125 2.5793 1.3900 1.4282 5.4860 1.3183 5.2287 2.5878 2.2739 2.1529 1.8045 1.7660 1.8871 2.1725 1.6380 1.2017 1.4538 2.0323 1.6917 2.0023 1.5116 1.6754 1.5410 1.2280 1.4863 1.8502 1.2775 1.3303 1.1934 5.4906 1.3300 1.3866 1.9655 2.3537 2.6060 2.8698 1.3937 1.1364 1.3088 1.2946 1.0686 1.1266 2.1375 1.4964 7.1490 6.6379 7.2705 7.2947 1.0359 1.0358 1.0602 1.0607 1.0835 1.1026 1.1023 1.0997 1.0994 1.1010 1.1007 1.0852 1.0890 1.0892 1.0949 1.0903 1.1001 1.0930 1.0661
irintensity: 1.2566 0.4762 0.2236 0.1333 0.0191 0.2690 0.7936 1.3737 0.6122 0.2440 0.4259 0.4047 1.3322 1.0064 1.7921 0.4051 100.7142 8.8047 8.9809 4.0324 4.7816 4.5093 3.8309 0.6386 7.2419 1.8331 8.9046 8.0034 3.9017 3.0722 1.7351 65.0766 5.7024 57.1932 3.6588 18.7201 29.4974 19.5185 7.4742 10.8157 1.2972 6.1576 10.2782 1.5341 2.4722 54.7822 0.0302 10.9067 5.2886 26.2102 14.0870 23.2731 17.7763 16.3446 42.1300 1.6747 3.5974 2.1240 17.7032 5.4029 57.4706 8.9405 15.2070 90.2851 5.4008 21.3329 10.5537 15.9798 111.4076 42.6997 5.4694 0.7886 35.7724 38.5616 18.5199 31.8811 42.3161 82.6857 31.3651 12.0703 28.7229 2.1583 28.5895 74.3749 107.5472 23.8858 0.2967 131.7666 233.9039 34.5051 27.7496 51.4570 65.1286 11.5616 6.4887 16.2370 9.6736 82.4898 6.2227 88.2158 6.1614 10.0740 2.3497 30.4213 14.2935 44.7800 25.4914 6.8480
temp: 298.150 k
press: 1.00000 atm
elementType: 8 7 6 6 6 6 6 6 6 6 6 6 6 6 6 6 6 6 6 1 1 1 1 1 1 1 1 1 1 1 1 1 1 1 1 1 1 1
symmnumber: 1
zpe: 830075.0 jmol-1
zpe.correction: 0.316159 hartree
zpe.thermalcorrener: 0.333669 hartree
zpe.thermalcorrenthalpy: 0.334614 hartree
zpe.thermalcorrgfe: 0.270954 hartree
zpe.sumelectzpe: -787.811434 hartree
zpe.sumelectthermal: -787.793923 hartree
zpe.sumelectthermalent: -787.792979 hartree
zpe.sumelectthermalfe: -787.856638 hartree
dipole: -3.6170 -1.2302 -0.6203
dipole: 3.8705
quadrupole: -92.7806 -111.1291 -114.9400
quadrupole: -2.5795 -1.0488 2.3740
quadrupole: 13.5026 -4.8458 -8.6568 -2.5795 -1.0488 2.3740
hfenergy: -788.1275928 hartree
pointgroup: C01 [X(C17H19N1O1)]
dipole: 1.4169175 0.5053821 -0.2361108 debye
polarizability: 349.380376|-3.0412812|193.4674373|0.908378|-12.1176176|107.2665576 unknown
InChI: InChI=1S/C17H19NO/c1-3-18(4-2)12-9-10-14-13-7-5-6-8-15(13)17(19)16(14)11-12/h5-11,17,19H,3-4H2,1-2H3
charge 0 multiplicity 1
38 atoms
O  -1.33623 -2.796024 -0.281873
N  3.433754 0.009977 0.039669
C  -1.395018 -1.558571 0.526146
C  -0.251093 -0.571726 0.267266
C  -0.777128 0.72024 -0.024794
C  -2.637204 -0.696052 0.28486
C  -2.251685 0.647377 -0.01412
C  2.050063 0.235945 0.025905
C  1.121593 -0.829326 0.291053
C  0.121494 1.776333 -0.281478
C  1.510817 1.53893 -0.250475
C  -3.987898 -1.070733 0.333326
C  -3.239288 1.62746 -0.255781
C  4.395405 1.057144 -0.355395
C  4.002526 -1.286258 0.458745
C  -4.980179 -0.08618 0.081351
C  -4.60383 1.249217 -0.205214
C  4.806385 1.995273 0.805317
C  4.118637 -2.317465 -0.689488
H  -1.366454 -1.949115 1.560207
H  1.467859 -1.847888 0.486801
H  -0.242367 2.78731 -0.498964
H  2.18402 2.381573 -0.430893
H  -4.269859 -2.106308 0.554107
H  -2.963529 2.663723 -0.48216
H  5.296964 0.55461 -0.754911
H  3.977607 1.644945 -1.193718
H  5.007692 -1.092789 0.879777
H  3.400076 -1.70358 1.286767
H  -1.387822 -2.536588 -1.237975
H  -6.041155 -0.358275 0.110428
H  -5.380357 1.999943 -0.392956
H  3.929496 2.520196 1.222069
H  5.27602 1.420759 1.624233
H  5.533406 2.752147 0.455943
H  3.128209 -2.550679 -1.116906
H  4.755915 -1.926702 -1.503477
H  4.568357 -3.258742 -0.321992
