program: Gaussian 09
title: 000224116
version: EM64L-G09RevD.01
frameworkgroup: C1[X(C18H11NOS)]
method: RPBEPBE
basis: SDD
operation: Freq
keyword: #p
keyword: freq=noraman
keyword: PBEPBE/SDD
title: #p freq=noraman PBEPBE/SDD
converged: YES YES NO NO
title: Mulliken charges:
elementType: S O N C C C C C C C C C C C C C C C C C C H H H H H H H H H H H
charge: 0.257743 -0.154593 -0.060019 0.281440 0.284472 0.217876 0.223288 -0.315198 -0.383354 -0.530603 -0.401891 -0.417488 0.244126 -0.369911 -0.216968 -0.233799 -0.235345 -0.088687 -0.286036 -0.125324 -0.509835 0.247566 0.287330 0.247235 0.279678 0.257753 0.231155 0.236315 0.227853 0.284619 0.250309 0.270293
chargesum: 0.00000
title: Mulliken charges with hydrogens summed into heavy atoms:
elementType: S O N C C C C C C C C C C C C C C C C C C
charge: 0.257743 -0.154593 -0.060019 0.281440 0.284472 0.217876 0.223288 -0.315198 -0.135788 -0.243274 -0.154655 -0.137810 0.244126 -0.112158 0.014187 0.002516 -0.007492 -0.088687 -0.001417 0.124986 -0.239542
polarizability: 5.56971239e+02 8.03556593e+00 2.17101979e+02 9.65637791e+00 -5.07130663e+00 9.07169454e+01
1716.lowfreq: -5.1359 -2.7455 -0.1896 0.0008 0.0012 0.0014 26.7639 31.6825 43.6985
frequency: 26.7173 31.6657 43.6885 86.2976 124.2159 137.6218 150.2614 154.0665 172.6565 226.0099 264.2034 268.9193 291.4786 359.2220 398.2923 405.2488 436.4681 440.5471 471.5756 496.0084 521.1705 551.2904 569.5201 570.2518 593.8367 601.3523 640.0038 689.6879 692.6568 708.2317 714.2868 722.0919 752.9001 784.8962 794.3446 825.4836 832.9406 847.5379 849.0673 860.0977 897.9560 923.4549 926.5934 953.2355 966.0167 968.1793 974.5835 996.1945 996.4129 1026.1992 1032.3341 1068.0920 1082.4246 1095.0430 1126.9392 1145.0806 1168.0006 1182.6759 1201.8151 1227.3688 1245.9748 1274.3049 1293.1688 1344.4801 1352.8083 1373.1496 1388.7085 1441.7719 1444.4100 1449.5013 1463.9494 1475.7492 1537.7338 1567.2897 1582.2309 1599.5549 1603.5847 1620.3845 1637.9186 2966.3952 3129.1681 3137.9273 3141.0654 3142.2022 3151.8661 3166.8913 3167.5463 3178.9756 3200.2810 3239.2460
redmass: 7.2551 5.4703 7.1840 5.8167 4.1890 5.3579 5.5292 6.2674 6.2747 4.8853 5.2247 6.5579 4.8087 5.1118 7.5909 3.4145 3.6949 4.6865 4.9826 4.4641 5.7404 7.5716 3.6845 6.4473 4.2037 5.2625 7.1051 6.7138 3.9573 1.1766 7.1335 6.0235 1.4913 2.8463 5.1247 4.6045 2.9112 1.2837 3.1248 1.9259 1.5023 1.6913 1.4358 2.3808 2.1556 1.4924 1.4112 1.9507 2.3451 2.0024 1.7843 2.6267 1.2787 1.7849 1.6808 2.0855 1.2361 1.9452 2.4872 1.9856 1.8193 1.4293 1.6896 3.9516 3.0436 1.8206 3.7690 2.8790 2.9997 3.5515 4.8073 4.1686 6.2804 6.3984 7.4200 7.0219 8.1081 7.5975 10.5089 1.0864 1.0861 1.0896 1.0914 1.0901 1.0949 1.0967 1.0991 1.0900 1.0978 1.0999
irintensity: 1.4322 0.7107 0.4976 0.1397 0.4008 2.3646 0.9093 0.8209 0.8189 14.1892 3.5388 10.2804 4.0369 6.3924 2.9364 2.3428 1.6978 3.4030 6.9599 11.0898 0.4345 3.0615 0.9488 9.5321 6.9352 4.5558 5.9286 3.6737 4.4475 104.3481 11.0954 1.1201 81.3879 30.5607 9.0643 18.7509 8.6945 6.1067 57.9994 38.9716 0.7769 12.5248 4.3609 1.6855 21.8238 4.2256 2.3543 2.6063 3.1434 7.3903 21.3852 0.1134 3.8710 18.0181 1.8446 21.0672 7.8726 1.7915 91.3070 21.4108 9.5343 13.1792 22.0140 4.2612 24.2526 30.3915 7.8745 201.7009 5.3409 45.0381 13.3640 1.1899 11.6469 154.8806 35.0732 15.8716 54.5114 118.0772 82.0261 33.2611 4.6480 11.4528 1.5929 4.7044 16.4067 19.9821 31.5011 11.4473 1.3536 0.5661
temp: 298.150 k
press: 1.00000 atm
elementType: 16 8 7 6 6 6 6 6 6 6 6 6 6 6 6 6 6 6 6 6 6 1 1 1 1 1 1 1 1 1 1 1
symmnumber: 1
zpe: 612390.2 jmol-1
zpe.correction: 0.233247 hartree
zpe.thermalcorrener: 0.249690 hartree
zpe.thermalcorrenthalpy: 0.250634 hartree
zpe.thermalcorrgfe: 0.187416 hartree
zpe.sumelectzpe: -1219.134539 hartree
zpe.sumelectthermal: -1219.118097 hartree
zpe.sumelectthermalent: -1219.117153 hartree
zpe.sumelectthermalfe: -1219.180371 hartree
dipole: 0.4569 -2.9569 -0.6771
dipole: 3.0677
quadrupole: -85.0555 -126.5379 -133.5382
quadrupole: 7.9452 3.4848 -1.8915
quadrupole: 29.9884 -11.4940 -18.4943 7.9452 3.4848 -1.8915
hfenergy: -1219.3677866 hartree
pointgroup: C01 [X(C18H11N1O1S1)]
dipole: -0.2465945 1.1753378 0.1201385 debye
polarizability: 554.8153744|29.9852296|203.1811528|-4.52367|42.427269|106.7936359 unknown
InChI: InChI=1S/C18H11NOS/c20-18-16-6-2-1-5-14(16)15-8-7-12(10-17(15)18)19-11-13-4-3-9-21-13/h1-11H
charge 0 multiplicity 1
32 atoms
S  -5.558978 -1.447505 -1.17576
O  2.0570 -2.673487 -0.560565
N  -2.401133 0.619433 0.324343
C  1.843363 0.864484 0.120227
C  3.310726 0.663361 0.00673
C  1.19588 -0.39146 -0.089942
C  3.559143 -0.716859 -0.269209
C  2.244897 -1.445488 -0.33904
C  1.068965 2.005321 0.402544
C  -0.193545 -0.532221 -0.042297
C  4.386919 1.561139 0.1220
C  4.860338 -1.214081 -0.432944
C  -0.989202 0.628886 0.224778
C  -0.337959 1.874667 0.465424
C  5.7071 1.061435 -0.04208
C  5.946099 -0.307596 -0.315976
C  -3.133278 -0.237613 -0.355502
C  -4.571708 -0.294595 -0.177962
C  -5.392908 0.438602 0.684047
C  -6.784095 0.10879 0.575468
C  -7.047932 -0.879615 -0.367916
H  1.534102 2.980363 0.582533
H  -0.646984 -1.521076 -0.174242
H  4.22367 2.623712 0.332297
H  5.022632 -2.276295 -0.643782
H  -0.972652 2.735893 0.696712
H  6.556757 1.748035 0.044792
H  6.97436 -0.664483 -0.436705
H  -2.698773 -0.930146 -1.10554
H  -4.977747 1.184194 1.364935
H  -7.567701 0.580847 1.172581
H  -8.002859 -1.319442 -0.650046
