program: Gaussian 09
title: 000224121
version: EM64L-G09RevD.01
frameworkgroup: C1[X(C17H14BrNO3)]
method: RPBEPBE
basis: SDD
operation: Freq
keyword: #p
keyword: freq=noraman
keyword: PBEPBE/SDD
title: #p freq=noraman PBEPBE/SDD
converged: NO YES NO NO
title: Mulliken charges:
elementType: Br O O O N C C C C C C C C C C C C C C C C C H H H H H H H H H H H H H H
charge: 0.016229 -0.158736 -0.252618 -0.243270 -0.437836 0.278651 0.250098 0.288715 0.215933 -0.320343 -0.568149 -0.371193 0.678806 -0.524868 -0.404149 -0.421350 -0.217571 -0.236983 -0.462387 0.222526 -0.224070 -0.668307 0.291129 0.260152 0.245716 0.277691 0.349212 0.229291 0.234466 0.259795 0.259710 0.235137 0.235146 0.216788 0.233326 0.233314
chargesum: 0.00000
title: Mulliken charges with hydrogens summed into heavy atoms:
elementType: Br O O O N C C C C C C C C C C C C C C C C C
charge: 0.016229 -0.158736 -0.252618 -0.243270 -0.088624 0.278651 0.250098 0.288715 0.215933 -0.320343 -0.277020 -0.111042 0.678806 -0.524868 -0.158433 -0.143659 0.011720 -0.002517 0.057119 0.222526 0.246213 0.015121
polarizability: 3.90164697e+02 2.28436651e+01 2.53084228e+02 -4.78481337e-02 3.06305636e-02 9.30789190e+01
1716.lowfreq: -2.9259 -0.0011 0.0005 0.0009 3.1644 3.9344 21.7558 39.5995 41.7897
frequency: 21.7512 39.5960 41.6121 63.8752 67.6973 74.4074 111.6193 122.0338 126.0530 142.7505 160.8685 169.8894 207.7351 217.6011 222.9773 236.3575 247.9756 277.4660 336.3733 352.1085 391.2159 415.7532 420.2952 436.4474 492.5154 513.2795 535.6074 549.0690 587.1429 590.7813 601.7719 618.0939 651.2274 680.6451 706.5485 723.6027 750.2560 756.7161 777.3822 800.5209 814.5705 826.0542 857.3029 887.4660 893.2787 908.6787 921.4548 966.9623 980.7935 993.7414 1000.5709 1002.9671 1020.2707 1031.5891 1077.4270 1112.1415 1115.5422 1131.5728 1136.1977 1163.5467 1173.6892 1186.0271 1205.0107 1210.7260 1240.5062 1251.6835 1283.8045 1298.1958 1337.5754 1355.4608 1369.0898 1385.5667 1404.5989 1433.8130 1445.1564 1449.4716 1463.4570 1469.6139 1474.2448 1482.0588 1486.0244 1516.0146 1572.5350 1597.3052 1603.3472 1628.6123 1638.5759 1641.2113 2951.6904 2990.2332 2998.5366 3015.3922 3075.4831 3095.8303 3110.9008 3127.2936 3139.5763 3149.7270 3151.4524 3155.6311 3166.0601 3483.7086
redmass: 5.0190 5.7139 4.1671 5.9982 4.3202 3.8583 9.8641 3.3507 5.4132 5.0753 2.0934 6.4928 4.8251 5.4650 20.4775 5.7603 1.2764 7.8589 4.8546 5.5426 4.3418 7.4103 3.8248 2.9517 4.3125 5.3604 6.7407 1.7735 1.5609 7.7082 6.2839 4.6599 6.9229 6.4670 4.6611 6.3674 1.6256 5.8779 2.3308 1.0984 4.2017 2.4941 6.3716 1.3569 1.7015 1.9342 5.1614 1.4713 3.8641 1.3565 4.4472 1.8942 2.2937 2.1337 2.6819 2.4962 2.3477 5.0083 1.4626 1.4589 2.8404 1.9857 1.0804 2.5844 1.3188 1.1322 1.6331 1.8498 2.4181 2.0758 2.0487 3.7467 1.2675 2.0250 3.0558 2.5867 1.0396 1.2869 1.0761 2.4766 1.0698 4.5376 7.3225 7.1726 8.1410 8.3611 9.8533 8.4562 1.0579 1.1010 1.0359 1.0583 1.1069 1.0986 1.1031 1.0861 1.0897 1.0945 1.0915 1.0927 1.1002 1.0767
irintensity: 1.2515 1.3014 0.0034 0.8478 0.9053 0.8064 0.2240 1.1983 0.1078 0.0293 13.8016 0.7783 0.2102 0.3639 1.3608 22.1634 2.0041 3.7208 19.9047 0.0472 1.7661 4.9653 4.6855 3.1892 11.2915 6.8605 7.1842 19.8238 70.9138 11.1688 5.3266 3.2230 1.7099 1.2496 22.2234 1.9865 47.1738 34.9911 41.0869 4.4164 12.2564 0.1681 9.3737 18.6236 1.9405 17.9004 13.2063 6.3669 90.4917 0.0467 5.1556 0.6566 87.7697 1.5263 19.0101 49.3668 16.6642 125.7784 6.3177 87.4008 440.5983 21.4453 0.0126 18.0525 6.1446 0.0618 24.0729 40.2146 101.8080 6.2832 14.8094 8.9743 21.4671 76.9938 1.7106 66.1164 13.0108 1.3776 7.7390 78.8239 12.5218 493.5136 25.9573 108.8107 244.3675 120.0803 107.6768 181.2771 83.8166 14.7969 18.3250 17.1602 5.6505 26.8072 41.0130 3.9352 4.5342 11.9058 15.7734 2.2400 35.9501 190.6539
temp: 298.150 k
press: 1.00000 atm
elementType: 35 8 8 8 7 6 6 6 6 6 6 6 6 6 6 6 6 6 6 6 6 6 1 1 1 1 1 1 1 1 1 1 1 1 1 1
symmnumber: 1
zpe: 707571.0 jmol-1
zpe.correction: 0.269500 hartree
zpe.thermalcorrener: 0.289617 hartree
zpe.thermalcorrenthalpy: 0.290561 hartree
zpe.thermalcorrgfe: 0.218199 hartree
zpe.sumelectzpe: -948.565106 hartree
zpe.sumelectthermal: -948.544988 hartree
zpe.sumelectthermalent: -948.544044 hartree
zpe.sumelectthermalfe: -948.616406 hartree
dipole: 2.4312 0.2134 0.0007
dipole: 2.4405
quadrupole: -90.9378 -145.3887 -139.9435
quadrupole: -20.3820 -0.0054 0.0018
quadrupole: 34.4855 -19.9654 -14.5202 -20.3820 -0.0054 0.0018
hfenergy: -948.8346057 hartree
pointgroup: C01 [X(C17H14Br1N1O3)]
dipole: -0.9553365 0.0962659 -0.000466 debye
polarizability: 389.5543467|-24.5993581|253.6945231|0.0040523|-0.1058458|93.0789741 unknown
InChI: InChI=1S/C17H14BrNO3/c1-2-22-16(20)9-19-15-8-13-12(7-14(15)18)10-5-3-4-6-11(10)17(13)21/h3-8,19H,2,9H2,1H3
charge 0 multiplicity 1
36 atoms
Br -0.956124 3.700483 -0.002359
O  1.863436 -2.901768 0.002598
O  -5.382978 -1.008195 -0.001764
O  -4.922998 1.282397 0.000038
N  -2.229584 0.819245 -0.000001
C  2.021328 0.701028 -0.000667
C  1.248752 -0.494927 0.000576
C  3.460338 0.338916 -0.000655
C  3.565316 -1.087451 0.000601
C  2.182375 -1.680199 0.001418
C  -0.147606 -0.48723 0.000966
C  1.36151 1.943304 -0.001524
C  -0.847996 0.764189 -0.000075
C  -0.04887 1.955964 -0.001251
C  4.624904 1.127108 -0.001595
C  4.809339 -1.735708 0.000932
C  5.88738 0.473536 -0.001268
C  5.984816 -0.939466 -0.000018
C  -3.081363 -0.35844 0.000989
C  -4.540618 0.089079 -0.000368
C  -6.855846 -0.712808 -0.002368
C  -7.572486 -2.057744 -0.003041
H  -0.694762 -1.435221 0.002139
H  1.910829 2.889496 -0.002412
H  4.573963 2.221608 -0.002549
H  4.862201 -2.829664 0.001901
H  -2.707886 1.726404 0.000463
H  6.803046 1.075948 -0.001993
H  6.97051 -1.416729 0.000207
H  -2.914637 -1.002997 -0.887227
H  -2.915963 -1.00054 0.891351
H  -7.082378 -0.107459 0.893559
H  -7.081559 -0.106974 -0.898165
H  -8.665224 -1.893529 -0.003505
H  -7.309468 -2.646255 -0.898486
H  -7.310297 -2.6467 0.892353
