program: Gaussian 09
title: 000224128
version: EM64L-G09RevD.01
frameworkgroup: C1[X(C21H27NO)]
method: RPBEPBE
basis: SDD
operation: Freq
keyword: #p
keyword: freq=noraman
keyword: PBEPBE/SDD
title: #p freq=noraman PBEPBE/SDD
converged: YES YES NO NO
title: Mulliken charges:
elementType: O N C C C C C C C C C C C C C C C C C C C C C H H H H H H H H H H H H H H H H H H H H H H H H H H H
charge: -0.438393 -0.142367 0.223493 -0.343026 0.184408 0.456024 0.188736 0.189662 -0.446430 -0.447035 -0.584230 -0.351907 -0.353917 -0.428556 -0.386168 -0.406083 -0.404883 -0.334105 -0.334837 -0.242917 -0.230934 -0.695159 -0.694356 0.245926 0.217032 0.222508 0.216939 0.218344 0.260796 0.193051 0.228253 0.195175 0.224548 0.233253 0.227796 0.254936 0.236490 0.197847 0.190520 0.194772 0.192439 0.337499 0.224419 0.222014 0.210377 0.217400 0.216729 0.212313 0.217388 0.214216
chargesum: 0.00000
title: Mulliken charges with hydrogens summed into heavy atoms:
elementType: O N C C C C C C C C C C C C C C C C C C C C C
charge: -0.100894 -0.142367 0.223493 -0.097100 0.184408 0.456024 0.188736 0.189662 -0.006891 -0.011752 -0.323434 0.069397 0.065806 -0.195303 -0.158372 -0.151147 -0.168393 0.054261 0.052374 -0.018497 -0.008920 -0.050653 -0.050438
polarizability: 3.99735208e+02 -9.82796786e+00 2.43729659e+02 1.50026841e+00 2.25749483e+01 1.48586997e+02
1716.lowfreq: -2.8446 -0.0002 0.0003 0.0007 3.2789 10.5793 24.8853 29.8317 34.6129
frequency: 24.5739 29.5259 34.3707 38.1343 64.5589 76.4098 77.8806 107.6063 117.3473 119.8338 137.6099 149.6235 159.2122 165.1649 202.3452 222.2150 229.0418 236.1143 243.8344 289.6099 304.8797 343.2976 349.5052 356.0998 380.5005 396.6015 423.5989 436.9570 455.3927 475.9918 521.6782 538.8826 568.6847 577.2105 597.5470 614.0818 661.0941 699.8638 719.3247 734.5076 737.7406 743.6296 761.6649 779.1197 790.2170 796.4406 805.8752 819.4098 861.5793 877.7164 883.5983 899.9730 901.4073 925.1475 925.8916 937.8300 946.6633 962.7839 975.9941 981.5850 998.5888 1003.1604 1020.7572 1029.9276 1069.1863 1072.6950 1095.1941 1103.3496 1110.5782 1111.9140 1121.5209 1151.2284 1165.9067 1178.4035 1186.8033 1195.5745 1197.6927 1200.7052 1223.3240 1233.9721 1243.9009 1268.3656 1268.6393 1281.1587 1286.3221 1291.6325 1292.6529 1298.8226 1306.4729 1343.3286 1347.2830 1353.9563 1360.2868 1362.4919 1366.1260 1388.7463 1391.3110 1393.5368 1395.7076 1445.4878 1458.0633 1464.5520 1469.4356 1470.8129 1474.8486 1476.3176 1476.8913 1478.2542 1483.6553 1487.3865 1492.0317 1494.4356 1511.2797 1580.3144 1592.6013 1616.3878 1634.8811 2961.9478 2962.3823 2970.6707 2974.1791 2975.3560 2975.9202 2982.2250 2984.0217 3003.3445 3004.5566 3019.8980 3022.0908 3023.4314 3046.7347 3050.3841 3072.1213 3072.5643 3074.2976 3074.4910 3120.1870 3126.2683 3131.4627 3142.5957 3157.8824 3160.1112 3165.0870 3545.1751
redmass: 4.2340 4.2720 4.1146 4.1548 2.9805 1.5263 1.8576 3.8115 2.9290 3.2956 2.9413 3.2729 4.1257 3.3215 3.8836 2.3636 1.1939 1.3716 2.6376 3.1533 3.7629 3.7706 1.8300 2.1665 3.5036 2.7922 3.0568 2.9855 3.2425 3.7212 5.1169 4.6639 4.1007 3.5320 4.5573 4.5578 4.4536 4.2898 4.7888 1.0753 1.0938 1.7074 3.6911 2.3243 1.1735 1.2255 1.6367 3.4523 1.6073 1.5358 3.0852 1.8302 1.7601 1.2246 1.3942 1.3610 1.4229 6.0277 2.7886 1.3176 4.2436 4.0727 2.5459 2.4126 2.5441 2.5403 2.0352 1.7345 2.2618 2.3150 2.1808 1.5921 1.1998 1.5125 2.0217 1.9256 1.8179 1.2915 1.5428 1.5559 1.7665 1.2811 1.2923 1.3521 1.1123 1.1011 1.1555 1.4874 1.7732 1.4003 1.4580 1.1833 1.4450 1.5039 5.0795 2.4499 1.2581 1.3209 2.1935 2.5795 2.9076 1.5789 1.1075 1.1426 1.2036 1.0513 1.2279 1.0499 1.1264 1.1193 1.1063 1.8646 1.6604 7.2176 6.6308 7.2486 7.3493 1.0590 1.0591 1.0592 1.0544 1.0370 1.0419 1.0616 1.0608 1.0980 1.0972 1.1018 1.0835 1.1013 1.1049 1.1046 1.1006 1.1004 1.0996 1.0997 1.0851 1.0889 1.0891 1.0949 1.0903 1.1001 1.0931 1.0661
irintensity: 0.2139 0.2299 0.0579 0.3931 0.2256 0.0541 0.1505 0.0648 0.1750 0.2072 0.1486 0.4674 0.5417 0.9548 0.6934 0.8799 0.1297 0.1336 0.4876 2.7927 3.7219 0.4670 60.0690 49.3252 1.1702 0.7057 16.5188 2.4031 4.1563 3.3107 2.5390 1.8091 1.0509 9.2326 10.7527 6.5875 5.0952 1.2447 2.2394 6.5359 9.1770 62.7758 36.5075 28.4969 0.1604 0.9962 23.5486 18.9752 19.2286 2.1355 32.2840 5.3811 8.1070 4.2807 8.6515 0.8873 2.2620 60.3119 1.4426 0.0188 0.4183 5.7869 0.3917 21.4338 0.4281 0.3745 14.5931 27.3858 23.2487 13.9283 34.3628 3.2457 3.3502 2.0311 11.2269 31.6883 7.7638 20.1520 48.8185 7.8308 3.7079 0.8878 2.4810 44.0662 1.6194 1.3549 10.9702 29.5520 9.9196 4.4550 7.0648 33.7931 18.4491 122.4056 3.8881 27.9223 9.6676 11.7693 9.9304 32.3043 45.3037 88.4048 4.7028 13.2897 10.8851 20.4216 31.0813 6.3620 11.2063 2.6621 38.8272 47.7562 136.2005 24.1235 0.2305 143.6832 249.3666 24.9386 21.4808 3.7806 0.2981 56.3339 20.9390 132.2474 57.1509 8.4928 9.0320 2.3445 11.7750 0.9976 21.1220 72.4715 72.8988 65.8300 54.5369 76.9839 6.2267 11.4428 2.1285 30.6049 16.3783 45.2958 27.5176 6.7038
temp: 298.150 k
press: 1.00000 atm
elementType: 8 7 6 6 6 6 6 6 6 6 6 6 6 6 6 6 6 6 6 6 6 6 6 1 1 1 1 1 1 1 1 1 1 1 1 1 1 1 1 1 1 1 1 1 1 1 1 1 1 1
symmnumber: 1
zpe: 1123372.6 jmol-1
zpe.correction: 0.427870 hartree
zpe.thermalcorrener: 0.451025 hartree
zpe.thermalcorrenthalpy: 0.451969 hartree
zpe.thermalcorrgfe: 0.373702 hartree
zpe.sumelectzpe: -944.704086 hartree
zpe.sumelectthermal: -944.680931 hartree
zpe.sumelectthermalent: -944.679987 hartree
zpe.sumelectthermalfe: -944.758254 hartree
dipole: -3.7947 -0.9317 -0.8352
dipole: 3.9957
quadrupole: -125.7412 -136.3881 -140.5748
quadrupole: -3.5250 -2.0283 2.9964
quadrupole: 8.4935 -2.1534 -6.3401 -3.5250 -2.0283 2.9964
hfenergy: -945.1319561 hartree
pointgroup: C01 [X(C21H27N1O1)]
dipole: 1.480521 -0.4154059 0.3267447 debye
polarizability: 400.2222715|4.496423|243.066735|0.1293614|-22.9918903|148.7628573 unknown
InChI: InChI=1S/C21H27NO/c1-3-5-13-22(14-6-4-2)16-11-12-18-17-9-7-8-10-19(17)21(23)20(18)15-16/h7-12,15,21,23H,3-6,13-14H2,1-2H3
charge 0 multiplicity 1
50 atoms
O  -2.34548 2.704132 -0.194495
N  2.473472 -0.02185 0.008099
C  -1.217829 0.439419 -0.347251
C  -2.375778 1.345742 -0.779328
C  -1.724319 -0.793467 0.157483
C  1.094699 -0.26918 0.047527
C  -3.605329 0.514241 -0.402615
C  -3.199694 -0.751129 0.123941
C  3.020697 1.205577 -0.601164
C  3.448973 -0.977319 0.56588
C  0.149927 0.716638 -0.402726
C  3.084554 2.418954 0.361188
C  3.878762 -2.09314 -0.420907
C  -0.809438 -1.772128 0.598375
C  0.575432 -1.515988 0.537768
C  -4.961656 0.849535 -0.524902
C  -4.172964 -1.694163 0.521384
C  3.683063 3.673011 -0.31477
C  4.911674 -3.060745 0.199786
C  -5.939557 -0.096218 -0.116573
C  -5.543231 -1.355969 0.396316
C  3.749773 4.888346 0.635054
C  5.357082 -4.16668 -0.781141
H  -2.343998 1.554202 -1.864775
H  4.043517 0.979592 -0.961532
H  2.432239 1.471522 -1.500621
H  4.34686 -0.405981 0.872857
H  3.043757 -1.429786 1.491792
H  0.479371 1.693072 -0.768179
H  3.69312 2.146316 1.247486
H  2.068214 2.64597 0.737204
H  4.306596 -1.62503 -1.330613
H  2.985895 -2.658795 -0.751453
H  -1.157353 -2.737345 0.984479
H  1.26241 -2.299275 0.869051
H  -5.259067 1.826795 -0.921379
H  -3.881721 -2.671485 0.922887
H  3.075698 3.935012 -1.205529
H  4.701119 3.439932 -0.690145
H  4.479146 -3.526043 1.109537
H  5.798719 -2.485726 0.537283
H  -2.403182 2.610657 0.79144
H  -7.004682 0.146903 -0.199798
H  -6.308568 -2.078435 0.703134
H  4.378002 4.668418 1.518677
H  4.176286 5.773551 0.128763
H  2.741744 5.160416 0.999669
H  5.826261 -3.731538 -1.68339
H  6.090494 -4.849469 -0.314515
H  4.493486 -4.772974 -1.112864
