program: Gaussian 09
title: 000224104
version: EM64L-G09RevD.01
frameworkgroup: C1[X(C14H11NO)]
method: RPBEPBE
basis: SDD
operation: Freq
keyword: #p
keyword: freq=noraman
keyword: PBEPBE/SDD
title: #p freq=noraman PBEPBE/SDD
converged: NO YES NO NO
title: Mulliken charges:
elementType: O N C C C C C C C C C C C C C C H H H H H H H H H H H
charge: -0.162393 -0.419313 0.275928 0.293458 0.230066 0.213498 -0.320906 -0.576008 -0.387808 0.490162 -0.410713 -0.419703 -0.433197 -0.216792 -0.240718 -0.634750 0.287537 0.240833 0.242952 0.276195 0.217093 0.226389 0.232410 0.298921 0.236483 0.236590 0.223787
chargesum: 0.00000
title: Mulliken charges with hydrogens summed into heavy atoms:
elementType: O N C C C C C C C C C C C C C C
charge: -0.162393 -0.120391 0.275928 0.293458 0.230066 0.213498 -0.320906 -0.288471 -0.146976 0.490162 -0.167761 -0.143508 -0.216104 0.009597 -0.008308 0.062110
polarizability: 3.00523441e+02 2.46015233e+00 1.70932954e+02 -5.11769836e-02 -2.35307578e-02 6.59821300e+01
1716.lowfreq: -0.0006 0.0004 0.0005 1.2632 6.2839 8.7784 57.2571 109.4845 135.7830
frequency: 57.2353 109.4785 135.7817 140.9064 147.9066 158.3330 213.5700 215.1631 273.6090 332.0894 369.0184 373.0006 405.4502 437.9565 459.7813 492.1650 514.7498 542.1433 581.0980 601.7194 641.6087 687.1572 711.9317 724.6129 751.5451 780.6377 825.8371 826.1477 829.3310 891.3044 909.2079 947.8796 952.5053 965.1265 991.7366 994.1293 1026.6077 1060.8706 1078.9488 1103.1584 1124.1293 1137.9513 1163.9033 1169.4117 1186.6988 1224.9522 1275.9823 1291.2921 1309.7796 1363.9962 1385.3806 1438.3245 1444.0377 1448.7503 1468.0468 1477.5853 1486.7395 1501.3466 1515.5574 1591.0016 1596.6623 1605.0053 1630.8293 1640.6988 2950.9698 3015.9490 3096.7714 3114.8885 3125.3466 3138.9584 3142.4733 3148.6763 3159.2573 3165.2608 3588.0492
redmass: 4.3854 3.4187 4.0605 3.4638 2.9518 1.5884 4.1590 2.8377 7.7900 3.3342 5.7612 1.2834 3.3667 3.0573 4.3426 4.4227 5.4196 7.5498 3.0032 5.5667 6.7918 3.7443 6.2821 5.6751 1.4702 2.6271 5.9234 1.5987 2.5810 1.4754 1.9490 1.3993 3.8077 1.4812 1.3539 5.2842 2.0440 2.3572 2.5797 2.2752 1.2779 1.8332 1.5064 1.3151 2.0142 1.8176 1.5005 1.5943 2.5380 4.6203 3.6094 2.0658 1.3729 2.5253 1.0400 3.6350 1.6100 1.5465 2.3750 6.4241 6.9581 7.8521 8.5453 8.5948 1.0375 1.1013 1.0963 1.0875 1.0858 1.0900 1.0955 1.0948 1.0916 1.1001 1.0774
irintensity: 5.2345 0.1149 1.7879 2.9724 0.7625 2.2069 0.6903 0.1366 3.3208 3.4137 0.6785 111.3132 0.5276 0.0896 1.8469 7.0778 0.3309 3.7903 3.8833 6.9768 2.2392 0.4379 2.1674 1.4841 79.5772 38.4670 25.3748 36.2014 0.8104 5.6134 13.7745 0.2139 17.6004 6.6249 0.0400 1.7486 1.2032 2.5763 14.0982 5.7862 1.7620 17.2161 8.2099 13.9121 23.3541 6.4843 4.5261 3.1528 87.7312 55.6565 8.1331 2.2516 82.8407 13.1832 13.4574 25.6200 24.4964 2.8329 354.3873 19.5647 79.2654 237.5620 76.6739 160.6392 104.8917 46.5182 27.3353 20.8411 3.6652 1.3854 20.3552 23.8478 10.3226 33.1562 67.0546
temp: 298.150 k
press: 1.00000 atm
elementType: 8 7 6 6 6 6 6 6 6 6 6 6 6 6 6 6 1 1 1 1 1 1 1 1 1 1 1
symmnumber: 1
zpe: 552591.6 jmol-1
zpe.correction: 0.210471 hartree
zpe.thermalcorrener: 0.223349 hartree
zpe.thermalcorrenthalpy: 0.224293 hartree
zpe.thermalcorrgfe: 0.171403 hartree
zpe.sumelectzpe: -668.984306 hartree
zpe.sumelectthermal: -668.971428 hartree
zpe.sumelectthermalent: -668.970484 hartree
zpe.sumelectthermalfe: -669.023374 hartree
dipole: 3.1284 -3.6804 0.0129
dipole: 4.8304
quadrupole: -58.7708 -92.5077 -98.4207
quadrupole: 0.4119 0.0552 -0.0057
quadrupole: 24.4622 -9.2746 -15.1876 0.4119 0.0552 -0.0057
hfenergy: -669.194777 hartree
pointgroup: C01 [X(C14H11N1O1)]
dipole: -1.2504335 1.4303068 0.0478555 debye
polarizability: 300.37494|4.067205|170.8194923|3.836482|4.6347111|66.2440926 unknown
InChI: InChI=1S/C14H11NO/c1-15-9-6-7-11-10-4-2-3-5-12(10)14(16)13(11)8-9/h2-8,15H,1H3
charge 0 multiplicity 1
27 atoms
O  0.370046 -2.769187 -0.171771
N  -4.226873 0.324963 -0.10939
C  -0.009221 0.815625 -0.021137
C  1.466847 0.666317 -0.004587
C  -0.597449 -0.48111 -0.087398
C  1.782995 -0.728017 -0.060212
C  0.502137 -1.514668 -0.115058
C  -1.980345 -0.685804 -0.118362
C  -0.851153 1.943923 0.015006
C  -2.841032 0.459187 -0.081775
C  2.504653 1.614534 0.05266
C  3.108158 -1.186973 -0.059376
C  -2.251293 1.762828 -0.015145
C  3.849238 1.153178 0.053637
C  4.154284 -0.228748 -0.001446
C  -4.919115 -0.96089 -0.170047
H  -2.377952 -1.703705 -0.169873
H  -0.441537 2.958985 0.066078
H  2.293453 2.688717 0.095967
H  3.319203 -2.260802 -0.102961
H  -2.909438 2.640816 0.012886
H  4.666769 1.882113 0.097968
H  5.199587 -0.55549 0.000761
H  -4.786914 1.174748 -0.077778
H  -4.678662 -1.601247 0.702524
H  -4.661915 -1.526095 -1.088475
H  -6.007472 -0.786697 -0.173096
