program: Gaussian 09
title: 000224095
version: EM64L-G09RevD.01
frameworkgroup: C1[X(C13H8BrNO2)]
method: RPBEPBE
basis: SDD
operation: Freq
keyword: #p
keyword: freq=noraman
keyword: PBEPBE/SDD
title: #p freq=noraman PBEPBE/SDD
converged: YES YES NO NO
title: Mulliken charges:
elementType: Br O O N C C C C C C C C C C C C C H H H H H H H H
charge: 0.000658 -0.209539 -0.205633 0.017818 -0.818862 0.388253 0.197048 0.351631 0.198687 -0.531955 -0.364585 -0.377315 -0.382418 0.406824 -0.379661 -0.228663 -0.221536 0.328807 0.308126 0.253853 0.259334 0.246754 0.289590 0.236944 0.235843
chargesum: 0.00000
title: Mulliken charges with hydrogens summed into heavy atoms:
elementType: Br O O N C C C C C C C C C C C C C
charge: 0.000658 -0.209539 -0.205633 0.017818 -0.490056 0.388253 0.197048 0.351631 0.198687 -0.223829 -0.110733 -0.117982 -0.135663 0.406824 -0.090072 0.008281 0.014307
polarizability: 2.96550910e+02 1.43795111e+01 1.94518758e+02 -5.43391088e+00 1.59275199e+01 8.18905623e+01
1716.lowfreq: -7.2158 -0.0009 -0.0008 -0.0007 2.8081 4.8931 44.4249 55.2232 74.5751
frequency: 44.4223 55.2180 74.5690 86.0195 137.0205 142.2917 189.6151 222.7680 256.6820 312.7738 322.1851 415.1672 442.5973 450.1074 477.7631 494.5018 544.1585 553.1498 568.9976 631.2728 635.9114 660.8461 702.0476 729.4780 746.4976 766.2995 770.1022 791.8407 840.6610 858.1460 887.5401 903.7257 947.9915 959.1148 991.4379 995.4829 996.8398 1026.2948 1069.8386 1100.2936 1123.6115 1125.3592 1162.6026 1176.0382 1184.1927 1201.9138 1209.8615 1242.1482 1283.7029 1305.0177 1360.4888 1386.8926 1405.7105 1436.6675 1445.1148 1463.4978 1488.9927 1591.6278 1593.2429 1616.6392 1619.9916 3081.2385 3133.3944 3141.9266 3151.8963 3153.7700 3169.7951 3177.0219 3184.7262
redmass: 8.6438 11.7001 8.6632 9.1422 4.6432 6.3357 5.7279 8.4167 7.5452 7.5612 5.0833 3.2382 3.6621 4.5288 7.0790 6.2951 5.4246 3.7599 5.5135 4.8561 7.2972 7.4335 5.5298 6.2885 2.0738 4.5677 3.3357 2.3297 4.3541 1.5006 1.5409 3.9501 1.5229 1.4175 1.3676 2.2725 2.2148 2.1312 1.9426 2.0301 1.1456 1.5540 1.4319 1.1377 2.5103 2.2282 6.7236 1.9705 1.6401 1.8147 9.3974 6.8870 4.0853 2.8932 3.2128 2.9323 4.9959 8.0188 6.7408 7.2005 7.7252 1.0872 1.0861 1.0899 1.0911 1.0947 1.1004 1.0930 1.0951
irintensity: 0.2042 0.3011 0.0397 0.5511 3.0980 0.9436 3.5646 4.4964 0.7306 0.4108 0.2976 3.1139 6.5420 9.1984 2.3884 3.7691 0.6154 0.1706 1.2556 48.1881 2.4007 14.3384 5.8032 14.9397 79.7111 4.2690 13.9181 21.4686 8.3040 28.0698 0.3513 10.6321 17.1133 1.3394 1.0056 0.9693 1.1808 0.8964 41.2641 1.7783 25.6458 10.3348 18.2489 0.4430 13.0055 5.3173 480.3964 71.7840 3.3712 4.6562 92.3698 5.2546 22.3430 10.4872 34.2448 3.0106 8.4758 6.3410 6.1882 51.9426 53.5200 2.0939 1.2618 1.6826 0.8715 21.8238 30.1010 3.0593 2.2659
temp: 298.150 k
press: 1.00000 atm
elementType: 35 8 8 7 6 6 6 6 6 6 6 6 6 6 6 6 6 1 1 1 1 1 1 1 1
symmnumber: 1
zpe: 463067.0 jmol-1
zpe.correction: 0.176373 hartree
zpe.thermalcorrener: 0.189718 hartree
zpe.thermalcorrenthalpy: 0.190662 hartree
zpe.thermalcorrgfe: 0.134402 hartree
zpe.sumelectzpe: -717.618614 hartree
zpe.sumelectthermal: -717.605269 hartree
zpe.sumelectthermalent: -717.604325 hartree
zpe.sumelectthermalfe: -717.660585 hartree
dipole: -6.1787 -3.4865 0.7551
dipole: 7.1346
quadrupole: -123.6046 -99.1781 -106.7342
quadrupole: 1.5021 -3.3253 4.9859
quadrupole: -13.7656 10.6608 3.1048 1.5021 -3.3253 4.9859
hfenergy: -717.7949871 hartree
pointgroup: C01 [X(C13H8Br1N1O2)]
dipole: -2.5754224 -1.0272695 0.4369755 debye
dipolederiv: -0.1743016 -0.0023395 0.0036191 0.0124869 -0.5862456 0.1863968 -0.0009593 0.375572 -0.2868283 -1.0005902 0.2174148 0.0221624 0.338514 -0.5765328 -0.0683944 0.0622698 -0.0688928 -0.2420135 -0.7829559 -0.1555089 -0.0488071 -0.3947493 -0.6750909 -0.1038012 -0.081244 -0.0943697 -0.2460195 2.3427285 0.0110482 0.0490473 0.2159119 1.0151488 0.1828346 0.0476563 0.168069 0.217575 0.3386986 0.0387452 -0.0106292 -0.0376063 0.7216223 -0.3291386 0.0090377 -0.516965 0.4700511 -0.4848203 -0.1963366 0.0290855 -0.4063354 -0.0420809 0.0092966 -0.0645535 0.0473266 -0.132207 0.8383811 -0.1526895 -0.0066299 0.023857 0.0628442 0.0093241 -0.0389545 0.0441407 0.0436631 -0.1568969 0.0848339 -0.0386859 -0.0825103 -0.0613249 0.0180767 -0.0444997 0.0371565 -0.1217947 -0.2616799 0.132716 -0.0022939 0.0228372 -0.0169918 -0.0057416 0.0450945 0.0336455 0.0129337 0.4339275 0.1366741 0.0064724 -0.135769 -0.0265614 0.0193748 -0.0244753 -0.0236017 -0.0738471 -0.5456354 0.1977421 -0.0027717 0.2435788 0.0731677 0.0506352 0.054587 0.0241307 -0.1233884 -0.0556374 -0.0890268 0.0016853 -0.175182 0.092046 0.0589477 -0.0357411 -0.0002094 -0.0988467 0.0265806 -0.1588462 0.016504 0.0931983 0.061896 0.0496762 0.0100247 0.0274321 -0.1247555 -1.1054814 -0.0872427 -0.0274581 -0.1380864 0.032834 -0.0172539 -0.0245663 -0.0119989 0.0485536 0.3138348 -0.0937827 -0.0005365 0.267909 -0.0697175 0.0361218 0.0479421 0.0118973 -0.0914685 0.0373376 -0.0076883 -0.0175361 -0.1264994 -0.0172027 0.0129994 -0.0268815 0.0124724 -0.1437507 -0.0583927 0.1438322 0.0002777 0.2778058 -0.0149256 0.0458859 0.0547855 0.0249104 -0.1299463 0.0143284 -0.0047014 -0.0038153 0.0042582 -0.0385821 0.0181328 -0.0015197 0.0544881 -0.0404256 0.1301527 -0.0255532 0.0027492 -0.0009839 0.0576972 -0.0146804 -0.0014256 0.0015262 0.1542946 0.0578654 -0.0737071 -0.0144551 -0.0491657 -0.0387938 -0.0305996 -0.0024423 -0.0378407 0.1461749 0.0768545 0.0192132 0.0009788 0.0695816 -0.0497914 -0.0379544 0.0143435 -0.0129421 0.1383808 0.0822327 0.0748063 0.0178001 0.030578 -0.0599682 -0.0356861 0.0009281 -0.0462193 0.1491218 0.0808819 0.060105 0.0134404 0.0240931 0.0822805 -0.0156187 0.0005226 -0.0130618 0.1649798 -0.1133797 0.0265376 0.0206464 0.0384569 0.0850995 -0.0139444 0.0140438 -0.0118144 0.1566917 -0.034033 -0.0962458 -0.0108495 -0.1161788 -0.0108265 -0.0248894 -0.0139727 -0.0248519 0.1528716 unknown
polarizability: 298.5387904|1.9795924|194.9548593|-1.4444144|-1.7701384|79.4665807 unknown
InChI: InChI=1S/C13H8BrNO2/c14-13-11-4-2-1-3-9(11)10-6-5-8(15(16)17)7-12(10)13/h1-7,13H
charge 0 multiplicity 1
25 atoms
Br -0.873833 3.06222 -1.033622
O  4.779108 -0.982139 -0.112731
O  4.394966 1.225129 0.320619
N  3.988276 0.021592 0.082432
C  -0.886948 1.556326 0.38537
C  0.2784 0.609433 0.187585
C  -0.217136 -0.711107 -0.05686
C  -2.104729 0.669154 0.240959
C  -1.690987 -0.673102 -0.023531
C  1.651429 0.871765 0.236999
C  0.678738 -1.783882 -0.258598
C  -3.466315 0.995142 0.349158
C  -2.646192 -1.699073 -0.180683
C  2.52862 -0.221468 0.033502
C  2.065838 -1.535945 -0.21452
C  -4.424892 -0.036593 0.190364
C  -4.017753 -1.369022 -0.072855
H  -0.848888 2.143071 1.316211
H  2.059478 1.871718 0.406221
H  0.311446 -2.798251 -0.443148
H  -3.783624 2.027041 0.532834
H  -2.340364 -2.732139 -0.378232
H  2.798411 -2.333043 -0.36559
H  -5.49205 0.197062 0.267863
H  -4.775598 -2.150491 -0.194048
