program: Gaussian 09
title: 000224093
version: EM64L-G09RevD.01
frameworkgroup: C1[X(C17H17NO)]
method: RPBEPBE
basis: SDD
operation: Freq
keyword: #p
keyword: freq=noraman
keyword: PBEPBE/SDD
title: #p freq=noraman PBEPBE/SDD
converged: YES YES NO NO
title: Mulliken charges:
elementType: O N C C C C C C C C C C C C C C C C C H H H H H H H H H H H H H H H H H
charge: -0.247532 -0.095044 -0.383959 0.282083 0.252676 -0.336910 -0.330875 0.147936 0.177406 -0.323426 -0.316286 -0.439075 -0.408172 -0.397789 -0.403438 -0.237888 -0.251979 -0.234283 -0.232173 0.243296 0.210926 0.230162 0.204857 0.192086 0.191583 0.214554 0.211539 0.189444 0.264141 0.239544 0.239707 0.240393 0.226857 0.226908 0.225926 0.226804
chargesum: 0.00000
title: Mulliken charges with hydrogens summed into heavy atoms:
elementType: O N C C C C C C C C C C C C C C C C C
charge: -0.247532 -0.095044 -0.140663 0.282083 0.252676 0.104179 0.066067 0.147936 0.177406 0.082711 0.084696 -0.174935 -0.168628 -0.158082 -0.163045 -0.011031 -0.025070 -0.008356 -0.005369
polarizability: 2.04912682e+02 -5.57896383e+00 2.45142550e+02 2.86208507e+01 2.93590550e+00 1.19341514e+02
1716.lowfreq: -10.4390 -6.7957 -0.9908 -0.0007 -0.0007 -0.0006 41.9351 47.6735 66.6573
frequency: 41.8841 47.4805 66.6456 96.8619 132.3038 171.1069 189.3204 215.5369 247.3259 281.4081 293.5749 309.3088 387.6222 406.9999 412.4544 441.6412 446.2943 465.0396 507.3285 516.1661 565.4532 591.4858 617.3080 634.8775 666.7566 711.3887 740.7241 744.1110 752.7965 789.7207 791.3949 813.7421 837.8795 839.2563 852.2302 881.8357 883.2954 917.5429 948.4474 955.3299 986.0212 988.2669 995.8787 997.0202 1020.0493 1024.1466 1030.4306 1050.9328 1077.1930 1082.9710 1097.6593 1104.0275 1128.2770 1143.9322 1160.5976 1163.7804 1172.6992 1178.1734 1184.9905 1198.9529 1228.8706 1239.5009 1272.2779 1288.0619 1293.2303 1301.3462 1311.3677 1332.9499 1351.3613 1367.9467 1369.0080 1375.5109 1403.1807 1437.1202 1441.4961 1442.9326 1447.8871 1448.5198 1457.0235 1464.9008 1480.7647 1590.4109 1594.9221 1614.8620 1619.6948 2881.0737 2902.2814 2952.0079 2956.4912 2959.3662 3021.3130 3043.4288 3077.1508 3082.3585 3122.6518 3123.7232 3132.4689 3134.2251 3145.4911 3146.3985 3161.5303 3162.4688
redmass: 3.7723 3.9695 4.2585 4.4992 3.7785 3.6795 4.3980 3.0463 2.6249 3.7176 3.9517 3.1365 1.9195 6.2995 3.1096 3.5651 3.5283 2.9023 5.1500 3.8219 3.3543 3.6929 6.2181 3.3265 3.8400 4.0553 2.1300 3.5398 1.3749 2.0452 3.9564 3.2361 2.6058 2.0476 2.9189 1.4927 1.6142 2.3115 1.4542 1.4841 1.3331 1.3453 5.5567 2.8341 2.2285 2.1616 2.0213 2.0414 3.5540 2.5686 2.2047 1.8035 2.1469 2.8596 1.4971 1.4058 1.1437 1.3514 1.0825 2.2781 1.2201 1.9232 1.3150 1.4678 1.4205 1.8694 1.3934 1.2329 1.3811 1.3000 1.3975 8.7168 3.5613 2.2086 1.0852 2.7632 1.0981 1.0874 1.1040 2.5797 3.9750 6.6047 7.0485 7.2337 7.2654 1.0681 1.0687 1.0662 1.0664 1.0818 1.0910 1.0912 1.0968 1.0977 1.0853 1.0851 1.0892 1.0895 1.0945 1.0948 1.1003 1.1003
irintensity: 0.0288 0.1879 0.1425 1.2963 0.5729 2.1845 0.2254 4.8813 2.6334 6.6655 0.4203 10.0197 0.0379 0.2038 4.0112 2.9769 0.9789 1.4351 0.7017 15.1066 0.0662 0.9273 4.1487 5.3180 8.2968 2.8506 5.6738 1.5471 147.6088 1.6163 3.2395 28.5408 7.8298 2.1655 3.7020 1.0403 0.9942 3.6783 0.8890 5.0557 0.1789 1.6601 7.8033 32.8628 3.3665 2.1416 8.9015 21.2695 32.8896 30.7152 2.5116 1.0984 26.3509 5.9544 3.2966 10.3928 0.3724 4.3952 1.8359 15.4243 11.3826 1.1022 3.2259 3.2871 3.8009 2.1942 26.0947 6.1389 0.4985 2.6454 0.8245 8.2919 1.3445 26.4754 2.7931 11.8771 22.6668 0.6334 6.0662 8.1362 0.2877 0.6906 0.7955 4.1458 1.7344 60.6226 51.7519 35.5393 98.5115 11.6193 46.0095 20.2234 41.5355 33.6924 3.2679 0.7700 7.7204 1.4061 4.8094 55.0698 60.5279 9.5452
temp: 298.150 k
press: 1.00000 atm
elementType: 8 7 6 6 6 6 6 6 6 6 6 6 6 6 6 6 6 6 6 1 1 1 1 1 1 1 1 1 1 1 1 1 1 1 1 1
symmnumber: 1
zpe: 778634.1 jmol-1
zpe.correction: 0.296566 hartree
zpe.thermalcorrener: 0.311531 hartree
zpe.thermalcorrenthalpy: 0.312475 hartree
zpe.thermalcorrgfe: 0.254136 hartree
zpe.sumelectzpe: -786.615151 hartree
zpe.sumelectthermal: -786.600185 hartree
zpe.sumelectthermalent: -786.599241 hartree
zpe.sumelectthermalfe: -786.657581 hartree
dipole: 1.3627 -0.0491 -0.7867
dipole: 1.5742
quadrupole: -114.5900 -101.4017 -111.3150
quadrupole: 0.3327 11.6134 -1.4149
quadrupole: -5.4877 7.7005 -2.2128 0.3327 11.6134 -1.4149
hfenergy: -786.9117166 hartree
pointgroup: C01 [X(C17H17N1O1)]
dipole: -0.5187403 -0.1510574 -0.3028053 debye
polarizability: 211.6463405|-16.468865|237.8155144|-28.237499|-9.282752|119.9348915 unknown
InChI: InChI=1S/C17H17NO/c1-3-7-15-13(5-1)14-6-2-4-8-16(14)17(15)18-9-11-19-12-10-18/h1-8,17H,9-12H2
charge 0 multiplicity 1
36 atoms
O  4.026121 1.419288 0.850848
N  1.483297 0.815466 -0.38046
C  0.263517 0.154039 -0.910084
C  -1.021297 0.874851 -0.484704
C  -0.035578 -1.302829 -0.479403
C  1.630331 0.791597 1.096293
C  2.755469 0.445946 -1.044682
C  -1.951334 -0.040577 0.085073
C  -1.33997 -1.386896 0.095692
C  2.749939 1.763055 1.506466
C  3.85336 1.43423 -0.611379
C  -1.329515 2.239313 -0.599541
C  0.755511 -2.458881 -0.607201
C  -3.214643 0.407938 0.52894
C  -1.850086 -2.620927 0.552091
C  -2.596632 2.692418 -0.151682
C  0.248832 -3.698949 -0.13891
C  -3.53079 1.781704 0.403729
C  -1.043016 -3.777522 0.43615
H  0.356808 0.190228 -2.01658
H  1.873787 -0.230692 1.471626
H  0.677537 1.109126 1.557821
H  2.620947 0.495369 -2.142533
H  3.092948 -0.585742 -0.779738
H  2.458779 2.800259 1.232788
H  2.953108 1.705154 2.588638
H  4.835021 1.151147 -1.026882
H  3.582691 2.458607 -0.947839
H  -0.595945 2.936862 -1.017694
H  1.748523 -2.417815 -1.066862
H  -3.940061 -0.287793 0.965586
H  -2.854304 -2.690354 0.985438
H  -2.858237 3.753354 -0.233846
H  0.859707 -4.604362 -0.227254
H  -4.506203 2.14835 0.743239
H  -1.421223 -4.743863 0.788257
