program: Gaussian 09
title: 000224099
version: EM64L-G09RevD.01
frameworkgroup: C1[X(C20H12O2S)]
method: RPBEPBE
basis: SDD
operation: Freq
keyword: #p
keyword: freq=noraman
keyword: PBEPBE/SDD
title: #p freq=noraman PBEPBE/SDD
converged: YES YES NO NO
title: Mulliken charges:
elementType: S O O C C C C C C C C C C C C C C C C C C C C H H H H H H H H H H H H
charge: 0.140705 -0.152035 -0.158395 0.302470 0.276675 0.187301 0.230862 -0.308694 -0.402079 -0.420522 -0.393742 -0.414121 -0.168007 -0.159774 -0.218238 -0.232060 -0.237607 0.405292 -0.348597 -0.303773 -0.218767 -0.231307 -0.218999 0.249592 0.296091 0.247737 0.280108 0.264984 0.231885 0.236748 0.274028 0.251885 0.237158 0.236187 0.237011
chargesum: 0.00000
title: Mulliken charges with hydrogens summed into heavy atoms:
elementType: S O O C C C C C C C C C C C C C C C C C C C C
charge: 0.140705 -0.152035 -0.158395 0.302470 0.276675 0.187301 0.230862 -0.308694 -0.152487 -0.124431 -0.146005 -0.134014 -0.168007 0.105210 0.013648 0.004688 -0.237607 0.405292 -0.074569 -0.051889 0.018390 0.004880 0.018012
polarizability: 4.76767557e+02 -1.17641159e+01 2.22569788e+02 -8.53868814e+00 3.54874830e+00 1.16466017e+02
1716.lowfreq: 0.0013 0.0016 0.0017 2.2315 4.7967 10.0325 16.7900 19.7433 34.7221
frequency: 16.6204 19.6714 34.7167 46.0216 81.0499 128.3625 135.0216 143.1206 152.1944 162.6834 190.9780 232.1738 274.4539 306.2688 327.1861 358.9972 396.5575 401.0441 403.7401 425.1608 437.1037 466.8777 480.6088 514.3757 529.1900 566.9370 576.8211 612.6996 627.0107 636.6778 660.7895 662.0985 681.4790 691.0575 720.8749 752.7126 781.8906 783.4134 788.3044 834.2400 845.9186 855.7031 863.0102 901.7171 924.1467 936.0164 945.8028 964.4142 970.8099 989.0166 990.0418 995.0568 998.1583 1007.9432 1025.7523 1026.4558 1060.3400 1079.7332 1090.0325 1112.9652 1157.4792 1171.5635 1175.8561 1186.9390 1192.3884 1205.9450 1222.7850 1272.7686 1292.8051 1321.2799 1357.8937 1382.3103 1388.7580 1431.9901 1436.2277 1441.4716 1451.0430 1476.5040 1477.0563 1581.0471 1588.3197 1594.1194 1601.2185 1606.3345 1614.5008 1622.9157 1637.3364 3130.4369 3133.3075 3141.5956 3142.4379 3143.5483 3152.2645 3153.1263 3157.1076 3163.0715 3168.1880 3172.9954 3178.5780
redmass: 5.5530 5.2211 6.4242 9.1150 6.6391 5.4953 5.0547 6.8514 6.1584 5.9016 5.9811 6.5245 7.9099 7.4348 5.3456 9.8803 2.8172 4.2126 5.9436 3.9008 3.1856 4.9984 7.8215 5.9567 7.5274 8.2633 3.4994 6.4598 5.0134 7.0244 7.9345 7.5908 4.4866 1.7801 6.0123 1.5393 2.4407 1.8713 7.0904 3.0167 1.4876 1.2554 7.3127 1.5099 7.0146 1.5538 1.4149 1.4190 1.4729 6.0074 1.4021 5.9741 1.3599 1.3368 2.1469 2.1794 1.9484 2.5465 1.5766 2.3390 1.8675 1.1716 1.0709 1.4913 2.0125 2.3425 2.0193 1.4784 1.6923 1.3144 7.0698 3.5564 9.0119 3.3804 2.2602 2.3494 2.7407 3.9024 2.3613 6.4608 7.8223 8.0854 7.0284 6.0791 7.9220 10.4764 10.7208 1.0861 1.0854 1.0902 1.0883 1.0903 1.0928 1.0949 1.0931 1.0963 1.1003 1.1014 1.0952
irintensity: 1.0734 0.0588 1.6028 2.2315 0.3474 0.6161 1.2289 0.4112 0.7609 0.1083 0.6413 12.4371 4.4805 10.7820 2.2113 0.4753 0.1576 5.6996 3.5991 0.8895 0.1656 11.0219 2.9186 1.9543 8.4879 2.3557 6.3151 2.6494 19.3658 2.1785 46.7790 92.0829 1.2386 55.7193 0.1370 73.1565 42.4751 41.4483 32.3506 0.7996 23.6580 1.6260 254.0565 0.0753 17.6096 8.3303 3.1780 1.6728 7.6922 3.3471 0.4321 6.3332 0.1053 0.1574 0.1549 1.8821 1.8853 0.8148 10.6131 78.1149 15.5221 19.5182 10.7565 238.0398 24.2230 122.3033 0.7639 30.8814 9.4677 2.9956 0.7243 17.4846 6.2280 40.1222 18.4163 60.0886 2.7936 1.3828 2.1919 33.6785 7.4238 108.8432 1.7737 27.3665 88.6339 106.9830 89.1907 2.8021 0.3964 5.7393 6.9319 6.1861 16.1574 15.3370 1.3747 12.8797 37.5003 27.4281 4.1530
temp: 298.150 k
press: 1.00000 atm
elementType: 16 8 8 6 6 6 6 6 6 6 6 6 6 6 6 6 6 6 6 6 6 6 6 1 1 1 1 1 1 1 1 1 1 1 1
symmnumber: 1
zpe: 672000.6 jmol-1
zpe.correction: 0.255952 hartree
zpe.thermalcorrener: 0.274302 hartree
zpe.thermalcorrenthalpy: 0.275246 hartree
zpe.thermalcorrgfe: 0.206566 hartree
zpe.sumelectzpe: -1316.315618 hartree
zpe.sumelectthermal: -1316.297267 hartree
zpe.sumelectthermalent: -1316.296323 hartree
zpe.sumelectthermalfe: -1316.365004 hartree
dipole: -1.9980 -2.9171 1.0096
dipole: 3.6770
quadrupole: -89.3444 -138.2934 -143.8785
quadrupole: -15.9922 1.9762 0.8182
quadrupole: 34.4944 -14.4546 -20.0397 -15.9922 1.9762 0.8182
hfenergy: -1316.5715696 hartree
pointgroup: C01 [X(C20H12O2S1)]
dipole: -0.7638819 1.032724 0.665402 debye
polarizability: 477.1295314|-2.4380401|153.8812649|10.6783534|50.6777727|184.7925652 unknown
InChI: InChI=1S/C20H12O2S/c21-19-17-9-5-4-8-15(17)16-11-10-14(12-18(16)19)23-20(22)13-6-2-1-3-7-13/h1-12H
charge 0 multiplicity 1
35 atoms
S  -2.085793 0.318537 -1.232956
O  3.105078 -2.263251 -1.913734
O  -2.436733 0.455316 1.508256
C  2.362375 0.636743 0.102849
C  3.82647 0.482184 0.316211
C  1.92227 -0.399049 -0.77499
C  4.275367 -0.647593 -0.432991
C  3.102186 -1.255742 -1.154542
C  1.438171 1.572082 0.599087
C  0.580719 -0.523266 -1.159945
C  4.739576 1.226213 1.08313
C  5.619871 -1.047419 -0.429535
C  -0.343903 0.43013 -0.660788
C  0.078896 1.467635 0.20538
C  6.103124 0.825524 1.089639
C  6.54215 -0.296024 0.344401
C  -3.022799 0.286085 0.417821
C  -4.493308 0.073032 0.276775
C  -5.278786 0.146551 1.461157
C  -5.124965 -0.195669 -0.966695
C  -6.673477 -0.041394 1.398928
C  -6.521576 -0.381095 -1.023803
C  -7.298625 -0.304034 0.156312
H  1.74416 2.377077 1.275327
H  0.262581 -1.33511 -1.821481
H  4.4197 2.096055 1.667114
H  5.938416 -1.918159 -1.012039
H  -0.651837 2.189817 0.578263
H  6.828267 1.394441 1.682282
H  7.598979 -0.582175 0.368026
H  -4.775881 0.350321 2.412015
H  -4.532573 -0.269086 -1.884851
H  -7.273251 0.016378 2.313468
H  -7.003707 -0.589286 -1.98464
H  -8.38334 -0.450269 0.10805
