program: Gaussian 09
title: 000224101
version: EM64L-G09RevD.01
frameworkgroup: C1[X(C26H14N2O3)]
method: RPBEPBE
basis: SDD
operation: Freq
keyword: #p
keyword: freq=noraman
keyword: PBEPBE/SDD
title: #p freq=noraman PBEPBE/SDD
converged: NO YES NO NO
title: Mulliken charges:
elementType: O O O N N C C C C C C C C C C C C C C C C C C C C C C C C C C H H H H H H H H H H H H H H
charge: -0.147482 -0.145634 -0.278831 -0.105358 -0.074487 0.288081 0.256036 0.281228 0.295045 0.281155 0.241971 0.219751 0.217890 -0.301863 -0.305105 -0.527028 -0.378179 0.409070 -0.499521 -0.380518 0.190087 -0.390777 -0.402053 -0.393564 -0.410625 -0.411224 -0.381791 -0.214935 -0.228274 -0.216426 -0.229209 0.325908 0.253101 0.350254 0.249688 0.249756 0.298365 0.248574 0.281886 0.281305 0.258763 0.234646 0.239206 0.233186 0.237934
chargesum: 0.00000
title: Mulliken charges with hydrogens summed into heavy atoms:
elementType: O O O N N C C C C C C C C C C C C C C C C C C C C C C C C C C
charge: -0.147482 -0.145634 -0.278831 -0.105358 -0.074487 0.288081 0.256036 0.281228 0.295045 0.281155 0.241971 0.219751 0.217890 -0.301863 -0.305105 -0.201121 -0.125078 0.409070 -0.149268 -0.130830 0.190087 -0.141021 -0.103688 -0.144990 -0.128738 -0.129919 -0.123028 0.019711 0.010932 0.016760 0.008725
polarizability: 8.52146165e+02 3.20099316e+01 3.26385487e+02 1.43082341e-02 -2.55307579e-02 1.08936597e+02
1716.lowfreq: -1.8124 -0.8412 -0.0008 0.0007 0.0016 4.9083 16.8113 20.7758 38.1269
frequency: 16.6697 20.6511 38.1263 44.9551 67.7741 104.3087 105.1919 130.1670 139.0261 145.1585 153.4014 155.9449 173.1389 189.8400 238.7932 258.1302 271.0650 316.0015 320.6333 340.2040 369.4956 374.5962 404.8851 407.3620 439.0404 441.5425 442.2491 459.7170 493.7943 495.4029 514.9281 523.0525 556.3698 561.8660 578.0414 592.6259 592.9258 637.5999 640.8408 648.0597 659.2974 693.1702 696.3697 720.2461 721.9010 732.4695 755.6153 756.1947 781.7654 788.4064 789.6697 833.7444 837.4442 839.0418 853.0336 858.5766 866.4075 902.0405 904.2263 940.1418 956.4378 961.1184 963.4012 973.4163 974.8638 983.1089 992.3832 994.6420 996.6293 999.3729 1000.4247 1025.8623 1027.8172 1049.3528 1070.2531 1082.5552 1094.9766 1116.0704 1137.7711 1147.5897 1168.9027 1170.4502 1180.1046 1189.8833 1199.2350 1214.7415 1222.8459 1237.7149 1268.6082 1276.2937 1293.7940 1293.9797 1338.6154 1374.8317 1379.2704 1389.5065 1399.9907 1438.5227 1442.4622 1446.3271 1448.2922 1454.0829 1456.1910 1476.5780 1482.7974 1575.4493 1594.3054 1596.9756 1599.1362 1600.0984 1601.9069 1614.1754 1618.9679 1638.1547 1638.7010 3130.9564 3132.8490 3142.0307 3143.9940 3144.1913 3149.4621 3153.7665 3155.1204 3168.6378 3169.3215 3169.6589 3185.7074 3193.0373 3212.3770
redmass: 6.8832 6.3818 6.9257 7.1166 9.0765 8.4059 6.2354 4.2918 4.5358 6.5424 6.6630 5.7898 5.7407 6.2012 6.4575 10.4686 8.5773 5.3363 6.7052 7.7474 4.7204 8.4385 3.2965 3.5221 3.1369 3.1302 7.0239 4.8125 7.3726 4.5750 5.7465 6.4397 3.6011 8.7048 6.9244 3.3856 7.8917 6.8328 7.2244 6.6582 7.6601 4.0783 4.2382 6.0348 5.9430 7.3071 1.4657 1.4546 7.1609 2.8097 2.9306 7.2983 3.0578 3.0725 9.6668 1.5135 1.4995 1.5320 1.5409 5.7248 4.2291 1.4688 1.4552 1.5432 1.5497 1.3958 1.3832 5.8148 5.4162 1.3642 1.3648 2.1302 2.0563 1.9965 2.8140 2.3569 1.8952 1.9556 1.4851 2.2139 1.2774 1.1836 1.8670 2.3834 2.6580 4.0598 2.1753 3.4989 1.6014 1.6162 1.7127 1.7099 7.3668 6.2706 7.7231 3.8592 3.3925 2.5474 2.4564 2.9563 3.7389 3.2675 3.0361 5.0129 5.4142 7.3602 8.1944 8.0146 7.7969 6.9986 7.4257 7.6492 7.7793 11.1686 10.8307 1.0863 1.0863 1.0895 1.0901 1.0898 1.0910 1.0949 1.0949 1.0993 1.0970 1.1004 1.0939 1.0931 1.0928
irintensity: 0.1178 4.6083 0.9337 0.0111 0.0581 0.0678 2.9999 0.8099 0.0463 0.5011 0.4841 0.3201 0.3179 0.0285 3.7017 13.0974 0.7078 0.1105 2.4319 1.0685 7.1756 26.1557 0.2210 0.8150 0.0156 0.1306 0.6564 0.5516 2.0126 13.2315 0.0478 2.9322 0.0008 0.9084 4.0674 11.2302 1.3000 0.1879 14.2531 6.1227 6.0865 0.0395 1.2939 3.1409 0.9806 0.9168 56.4544 115.7053 9.2818 13.1464 28.6133 36.6492 1.1193 2.1527 8.3121 20.6867 34.3224 0.0042 0.0220 18.8720 16.3865 0.9355 13.0029 5.5948 28.4807 0.0002 0.8404 2.0164 12.5843 0.3514 0.3117 0.0532 0.4405 13.5736 24.6862 1.0952 144.9334 13.1675 38.0741 8.0749 47.4429 3.1906 99.2619 11.2544 7.5639 23.6014 12.4344 11.2671 9.9364 26.2369 0.1892 11.2044 25.0246 9.7547 1.6854 16.4546 14.4907 1.2480 96.2847 0.5522 70.9776 5.1531 7.7929 7.2716 8.9817 39.4710 131.4702 96.2653 17.0328 0.2207 4.0916 150.8409 153.6536 55.8739 112.3297 3.9343 2.4406 6.6236 3.7873 6.0322 9.7573 14.7052 15.4537 38.1631 21.8395 39.1924 1.5645 2.1687 4.9387
temp: 298.150 k
press: 1.00000 atm
elementType: 8 8 8 7 7 6 6 6 6 6 6 6 6 6 6 6 6 6 6 6 6 6 6 6 6 6 6 6 6 6 6 1 1 1 1 1 1 1 1 1 1 1 1 1 1
symmnumber: 1
zpe: 858047.8 jmol-1
zpe.correction: 0.326813 hartree
zpe.thermalcorrener: 0.349595 hartree
zpe.thermalcorrenthalpy: 0.350539 hartree
zpe.thermalcorrgfe: 0.272967 hartree
zpe.sumelectzpe: -1332.256304 hartree
zpe.sumelectthermal: -1332.233523 hartree
zpe.sumelectthermalent: -1332.232579 hartree
zpe.sumelectthermalfe: -1332.310150 hartree
dipole: -1.9557 1.5838 0.0287
dipole: 2.5168
quadrupole: -103.4552 -177.8709 -182.8032
quadrupole: 37.9656 0.0111 -0.0101
quadrupole: 51.2546 -23.1611 -28.0934 37.9656 0.0111 -0.0101
hfenergy: -1332.5831174 hartree
pointgroup: C01 [X(C26H14N2O3)]
dipole: -0.7503664 0.154619 -0.6272798 debye
polarizability: 853.5791476|7.109003|120.1694688|-14.9079866|-47.9238236|313.7196324 unknown
InChI: InChI=1S/C26H14N2O3/c29-25-21-7-3-1-5-17(21)19-11-9-15(13-23(19)25)27-28(31)16-10-12-20-18-6-2-4-8-22(18)26(30)24(20)14-16/h1-14H
charge 0 multiplicity 1
45 atoms
O  -4.427926 0.482385 -2.852633
O  5.099853 -0.785486 2.772894
O  0.109513 -0.652669 2.125365
N  -0.384044 -0.376079 0.930698
N  0.29198 -0.112711 -0.178981
C  -4.65005 -0.327409 0.658561
C  -3.853111 -0.058726 -0.4975
C  -6.082112 -0.243474 0.272469
C  4.498428 0.030649 -0.689378
C  5.980443 0.025006 -0.630919
C  3.986445 -0.279156 0.607871
C  -6.158426 0.076176 -1.117781
C  6.378745 -0.289495 0.704667
C  -4.764572 0.206848 -1.669271
C  5.147859 -0.496886 1.546857
C  -2.455887 -0.063084 -0.455906
C  -4.027831 -0.607961 1.887721
C  -1.847657 -0.348974 0.793982
C  2.618471 -0.352247 0.888548
C  3.604149 0.276733 -1.750139
C  1.702162 -0.102082 -0.192091
C  -7.258643 -0.420493 1.021664
C  -2.613453 -0.618177 1.952212
C  6.952841 0.265441 -1.618634
C  -7.390413 0.222537 -1.772858
C  7.730037 -0.367905 1.071256
C  2.220802 0.207901 -1.492532
C  -8.508208 -0.273476 0.362284
C  -8.577684 0.043787 -1.016739
C  8.322761 0.186987 -1.251737
C  8.710985 -0.125279 0.074583
H  -1.848624 0.142471 -1.339469
H  -4.612364 -0.81696 2.789298
H  2.258788 -0.589927 1.88939
H  3.961705 0.516949 -2.756586
H  -7.225626 -0.666394 2.088483
H  -2.08353 -0.830865 2.884008
H  6.672699 0.50852 -2.64927
H  -7.423153 0.468057 -2.83935
H  8.009303 -0.610574 2.101779
H  1.492014 0.391992 -2.288098
H  -9.435672 -0.407823 0.929849
H  -9.555284 0.150924 -1.49838
H  9.094123 0.371361 -2.007764
H  9.774966 -0.178713 0.328277
