program: Gaussian 09
title: 000224091
version: EM64L-G09RevD.01
frameworkgroup: C1[X(C19H20N2O2)]
method: RPBEPBE
basis: SDD
operation: Freq
keyword: #p
keyword: freq=noraman
keyword: PBEPBE/SDD
title: #p freq=noraman PBEPBE/SDD
converged: NO YES NO NO
title: Mulliken charges:
elementType: O O N N C C C C C C C C C C C C C C C C C C C H H H H H H H H H H H H H H H H H H H H
charge: -0.247149 -0.261704 -0.095375 -0.449641 -0.396506 0.287091 0.274470 0.200369 0.162214 -0.336665 -0.331432 -0.323630 -0.318972 -0.565193 -0.439356 -0.398838 -0.404100 0.516830 -0.497799 -0.240459 -0.234272 0.210438 -0.800062 0.246670 0.227947 0.210460 0.212953 0.203745 0.212423 0.189941 0.186732 0.213874 0.317327 0.264425 0.241349 0.237723 0.218798 0.226399 0.224702 0.310522 0.235782 0.270035 0.237933
chargesum: 0.00000
title: Mulliken charges with hydrogens summed into heavy atoms:
elementType: O O N N C C C C C C C C C C C C C C C C C C C
charge: -0.247149 -0.261704 -0.095375 -0.139119 -0.149836 0.287091 0.274470 0.200369 0.162214 0.101742 0.085265 0.078734 0.081634 -0.247867 -0.174931 -0.157489 -0.166377 0.516830 -0.279001 -0.014060 -0.009570 0.210438 -0.056311
chargesum: 0.00008
polarizability: 3.43707987e+02 -1.91534694e+01 2.32054532e+02 -7.25811772e+00 -3.20771734e+01 1.39294676e+02
1716.lowfreq: -86.1112 -9.1051 -3.6676 -0.8635 -0.1730 -0.0008 3.3557 29.2190 43.7925
frequency: -86.1052 29.1743 43.7893 52.9938 61.0410 64.8609 100.4229 106.6578 136.8832 168.2900 180.4200 217.7198 239.5913 249.6930 273.1372 287.5341 308.4021 349.5406 355.4870 394.8897 418.2617 429.3054 448.4900 465.1114 476.9206 519.5624 529.1086 546.2433 569.6558 590.7121 606.1115 638.8775 643.4113 645.2370 680.9539 715.4867 736.0287 746.7078 771.6409 786.2358 801.1644 819.7722 829.3763 840.1646 851.7606 880.6971 914.8605 923.1470 932.0518 944.7268 948.3146 954.7344 986.0109 989.0532 997.1347 1000.3011 1024.1231 1025.2508 1029.2939 1051.8718 1077.7140 1084.5123 1099.3838 1108.0791 1134.5841 1143.0541 1147.1487 1162.6712 1172.5516 1188.4610 1197.9082 1216.1316 1230.0277 1233.1082 1269.0239 1274.6786 1282.3677 1295.2717 1305.7187 1312.4894 1334.2621 1352.8107 1366.2127 1370.2043 1373.1147 1375.1870 1385.9079 1437.7326 1441.7240 1445.8230 1449.6475 1450.6712 1451.6520 1457.8428 1461.9402 1467.6718 1486.7014 1511.1323 1593.4013 1595.8963 1618.8382 1622.1344 1629.8400 2900.0793 2906.3458 2950.7755 2955.0343 2964.1964 2986.9734 3024.4120 3042.0697 3071.7763 3078.3287 3081.3947 3110.3725 3121.6899 3132.8848 3136.6150 3143.6851 3145.4237 3161.2255 3196.9625 3519.8450
redmass: 1.0411 5.2334 4.8819 3.4801 4.7188 4.4886 4.7960 4.3539 3.8823 3.9305 5.5425 3.1879 3.7863 3.0860 3.7850 3.8723 3.1156 4.5124 4.8230 1.9987 3.3482 4.6634 3.1300 2.8766 4.2129 4.8703 3.8401 4.7014 3.1324 3.5249 2.9293 3.0008 1.9513 2.2846 4.0777 3.9124 4.6135 1.9055 2.2255 4.1872 3.9033 3.1078 1.7470 1.8039 2.8222 1.4951 2.2918 3.7210 3.9685 1.3929 1.4598 1.5300 1.3504 2.7347 2.6596 2.6671 2.0686 2.1339 1.6591 2.0339 3.6889 2.5310 2.1841 2.0729 2.2527 2.3392 1.6561 1.3022 1.1571 1.0802 2.4323 1.9989 1.2141 2.2901 1.8103 1.3379 1.4520 1.4262 2.2722 1.4278 1.2322 1.3706 4.0033 1.2647 1.4709 1.2811 4.6862 2.7500 1.0849 1.9773 1.2158 1.5494 1.0924 2.1978 1.1094 1.0471 3.8872 2.0531 7.1595 6.1447 7.2192 7.1634 4.9054 1.0690 1.0670 1.0663 1.0664 1.0820 1.0384 1.0926 1.0913 1.0984 1.0962 1.0980 1.0883 1.0853 1.0894 1.0978 1.0954 1.0949 1.1002 1.0927 1.0764
irintensity: 0.0009 0.5185 2.7662 1.1837 5.7744 2.7557 3.5423 0.5604 0.6843 2.4656 2.3990 4.1505 2.9984 0.5277 3.0436 0.6431 16.4593 0.8738 0.7996 0.0543 3.5655 6.4399 0.4852 2.1261 18.6272 1.3755 4.3108 4.9002 3.0121 2.1121 2.5042 15.6615 34.5189 19.7764 5.0152 1.5090 4.1924 41.8963 63.6217 4.0154 7.9101 21.0516 32.5108 2.3377 2.2953 0.6996 8.6997 1.9544 16.3952 3.2512 8.7560 11.8495 1.6190 22.6044 24.1294 10.9332 3.8589 9.1153 7.6017 20.3510 39.4712 21.6773 1.8965 0.6495 27.1045 6.2739 15.6918 5.9634 1.7948 1.8584 14.6551 18.1132 10.3593 78.8475 24.6445 3.7410 8.2751 6.6303 29.0919 18.1525 4.1597 0.9572 72.0523 2.8676 3.4729 75.2803 47.2713 72.2401 3.0319 107.1698 4.2926 51.3969 6.8031 15.5282 9.5461 19.8476 194.0596 184.5776 16.6071 66.0653 5.2384 21.9801 118.5548 37.8441 52.8252 30.1746 110.2968 11.0539 10.4576 43.7712 20.7768 15.1245 38.1994 32.3371 25.2670 1.8385 4.1564 6.6108 4.4398 42.0087 40.2921 4.6402 12.3464
temp: 298.150 k
press: 1.00000 atm
elementType: 8 8 7 7 6 6 6 6 6 6 6 6 6 6 6 6 6 6 6 6 6 6 6 1 1 1 1 1 1 1 1 1 1 1 1 1 1 1 1 1 1 1 1
symmnumber: 1
zpe: 918574.9 jmol-1
zpe.correction: 0.349867 hartree
zpe.thermalcorrener: 0.368962 hartree
zpe.thermalcorrenthalpy: 0.369907 hartree
zpe.thermalcorrgfe: 0.301626 hartree
zpe.sumelectzpe: -994.324779 hartree
zpe.sumelectthermal: -994.305683 hartree
zpe.sumelectthermalent: -994.304739 hartree
zpe.sumelectthermalfe: -994.373019 hartree
dipole: -1.5989 -4.3485 0.8351
dipole: 4.7079
quadrupole: -109.3837 -136.9834 -135.6414
quadrupole: 12.9834 -6.5966 -11.1299
quadrupole: 17.9525 -9.6473 -8.3052 12.9834 -6.5966 -11.1299
hfenergy: -994.6746458 hartree
pointgroup: C01 [X(C19H20N2O2)]
dipole: -0.3006125 -1.795204 0.3428785 debye
polarizability: 346.8435598|3.0097675|228.2955613|0.6595616|-33.682942|139.9180738 unknown
InChI: InChI=1S/C19H20N2O2/c1-13(22)20-14-6-7-16-15-4-2-3-5-17(15)19(18(16)12-14)21-8-10-23-11-9-21/h2-7,12,19-20H,8-11H2,1H3
charge 0 multiplicity 1
43 atoms
O  -0.0816 4.303621 0.971628
O  -4.279168 0.254091 -0.805698
N  0.761468 1.87122 -0.341731
N  -3.637095 -1.755998 0.229629
C  0.86896 0.489826 -0.875657
C  -0.113983 -0.58268 -0.344023
C  2.227158 -0.150385 -0.562979
C  0.611753 -1.688944 0.19002
C  2.05757 -1.426807 0.047848
C  0.7984 1.982487 1.137609
C  -0.335851 2.696394 -0.904558
C  0.990902 3.458006 1.526309
C  -0.118485 4.164023 -0.494558
C  -1.516829 -0.567823 -0.362881
C  3.508007 0.370715 -0.801059
C  -0.081866 -2.79452 0.726202
C  3.182465 -2.200663 0.409209
C  -2.214189 -1.681295 0.189709
C  -1.491386 -2.782733 0.729266
C  4.639192 -0.403964 -0.436534
C  4.474606 -1.679491 0.160135
C  -4.581184 -0.837834 -0.240054
C  -6.029441 -1.269962 -0.003531
H  0.742636 0.578655 -1.975488
H  1.645012 1.385735 1.523789
H  -0.1395 1.598602 1.604979
H  -1.34105 2.375479 -0.54282
H  -0.324456 2.611731 -2.008326
H  0.933932 3.594014 2.619181
H  1.976412 3.812785 1.153563
H  0.835381 4.533868 -0.929904
H  -0.954923 4.799979 -0.82913
H  -2.092742 0.253831 -0.78946
H  3.624351 1.362835 -1.250067
H  0.455791 -3.657214 1.134394
H  3.065536 -3.184903 0.876895
H  -2.040395 -3.636594 1.147773
H  5.648339 -0.016252 -0.615558
H  5.359296 -2.265384 0.434629
H  -4.014761 -2.601806 0.664157
H  -6.251806 -2.230673 -0.50424
H  -6.694346 -0.496481 -0.413077
H  -6.243909 -1.386394 1.075111
