program: Gaussian 09
title: 000224080
version: EM64L-G09RevD.01
frameworkgroup: C1[X(C21H16N2O)]
method: RPBEPBE
basis: SDD
operation: Freq
keyword: #p
keyword: freq=noraman
keyword: PBEPBE/SDD
title: #p freq=noraman PBEPBE/SDD
converged: YES YES NO NO
title: Mulliken charges:
elementType: O N N C C C C C C C C C C C C C C C C C C C C C H H H H H H H H H H H H H H H H
charge: -0.258563 0.020010 -0.438265 0.220236 0.229685 0.262743 0.233696 -0.420969 -0.400169 -0.413926 -0.439235 -0.364268 -0.230227 -0.228416 -0.234271 -0.266634 0.273157 -0.361690 -0.372337 0.480331 -0.350521 -0.432853 0.209916 -0.799896 0.245468 0.247910 0.283538 0.284136 0.227853 0.230691 0.231163 0.233516 0.265703 0.253758 0.310194 0.218030 0.308081 0.237728 0.269438 0.235260
chargesum: 0.00000
title: Mulliken charges with hydrogens summed into heavy atoms:
elementType: O N N C C C C C C C C C C C C C C C C C C C C C
charge: -0.258563 0.020010 -0.130184 0.220236 0.229685 0.262743 0.233696 -0.420969 -0.154700 -0.166015 -0.155696 -0.080132 -0.002374 0.002274 -0.003108 -0.033118 0.273157 -0.095987 -0.118579 0.480331 -0.040327 -0.214824 0.209916 -0.057470
polarizability: 4.88872339e+02 -1.19637570e+01 2.66115213e+02 -1.73193111e+01 -1.01623742e+01 1.34493815e+02
1716.lowfreq: -86.5346 -2.8355 -0.0006 -0.0003 0.0006 3.3100 5.8630 27.6575 30.2741
frequency: -86.5281 27.6549 30.2576 38.0187 72.0390 88.6037 97.0223 123.6237 138.6961 152.2973 170.8890 189.7907 229.3789 274.8087 300.5823 326.9688 371.5785 390.9648 405.6994 410.7764 423.6031 438.5108 462.1018 500.9079 512.0232 531.8651 554.0499 568.0206 581.9305 614.0500 617.4209 640.9020 641.8755 655.6016 664.7375 706.9845 728.5534 750.5523 751.2844 761.6247 804.3696 805.7823 818.9763 824.0775 841.4916 855.6705 893.6477 902.0443 915.1049 929.3216 944.1794 961.9838 965.3503 983.9031 984.6315 992.8177 994.8680 995.1561 1002.5013 1019.1499 1029.5968 1035.1689 1073.0947 1101.1894 1116.7735 1137.5314 1167.8354 1173.2021 1183.3062 1200.9407 1219.1512 1225.7728 1253.4427 1266.8197 1295.0058 1299.9928 1304.7522 1348.8616 1373.8429 1376.1371 1407.8807 1419.1646 1440.0812 1444.5896 1448.3514 1462.8598 1468.2905 1478.3676 1492.6552 1495.7809 1575.8122 1589.3486 1593.0432 1600.2272 1613.2967 1618.3975 1630.7389 1634.3234 2986.4371 3071.1365 3111.5205 3125.9096 3127.9581 3135.6781 3139.0492 3141.6188 3144.4692 3153.3310 3157.8366 3163.5324 3167.2276 3174.2282 3191.7630 3521.1000
redmass: 1.0419 5.3978 5.1082 5.3182 4.2877 4.6598 4.4661 5.6716 3.8109 5.5372 4.8115 5.0932 5.0594 4.8912 6.1845 4.3030 5.1137 4.2072 3.8537 3.8450 3.9322 3.9776 3.6288 4.8741 5.6119 3.2772 4.4728 3.2282 3.0202 6.6799 6.6774 2.6223 1.5910 5.3397 4.6803 5.5380 4.2040 5.1325 1.4989 1.4519 3.2360 3.0635 2.4977 1.4911 5.8279 1.5067 1.4548 1.6744 6.3486 6.0620 1.4008 1.4315 1.4450 1.6324 1.3769 1.3791 1.3464 5.5254 2.4723 2.2524 1.6533 1.9214 3.0290 1.7867 1.3462 1.9578 1.1344 1.1507 1.1730 2.1189 3.3176 2.2277 2.1231 2.3696 1.6379 1.5563 1.6978 4.7619 9.2867 1.2417 3.0162 3.7010 2.2538 2.8308 1.1925 2.6343 1.0470 3.2854 2.2977 2.8699 4.6181 6.5607 7.8840 7.2541 6.8999 7.1712 5.1309 9.0005 1.0384 1.0984 1.0897 1.0859 1.0859 1.0978 1.0904 1.0909 1.0907 1.0946 1.0958 1.0948 1.0996 1.0977 1.0947 1.0763
irintensity: 0.0251 0.1306 3.4804 5.8839 5.8319 0.7484 4.3537 6.1712 0.7654 0.0391 0.8581 0.3314 0.1968 4.0828 0.6263 1.5492 6.4118 1.9511 7.0042 3.1766 2.9014 9.3175 8.0670 9.3093 3.7016 12.9143 9.7126 1.0486 0.6209 2.8095 4.7003 19.7229 49.8498 2.4066 18.7922 3.6947 1.1949 10.0116 134.6216 1.0990 2.2404 4.4079 32.5465 21.9797 2.8177 64.5848 0.4307 0.8739 35.7456 11.1301 3.4798 0.4348 5.1422 26.6690 9.7885 0.3567 0.1597 2.8292 10.5221 2.3777 7.9419 2.5758 0.2819 11.7633 17.3864 3.0440 2.7055 1.1966 7.2840 28.7226 65.0073 8.2214 40.4897 23.5888 5.9435 26.5268 39.1803 161.1281 6.7672 64.4788 1.7277 62.6222 52.0602 30.6997 61.0410 0.6629 19.3285 3.4631 27.0753 583.0783 96.5765 2.4631 20.6035 0.4043 21.6169 43.8522 137.3335 36.8666 11.5325 15.5161 32.2683 2.6386 1.6722 7.6291 8.4225 8.2810 7.8672 24.4937 29.9014 7.2524 35.9300 12.3577 5.7044 14.1129
temp: 298.150 k
press: 1.00000 atm
elementType: 8 7 7 6 6 6 6 6 6 6 6 6 6 6 6 6 6 6 6 6 6 6 6 6 1 1 1 1 1 1 1 1 1 1 1 1 1 1 1 1
symmnumber: 1
zpe: 816389.7 jmol-1
zpe.correction: 0.310946 hartree
zpe.thermalcorrener: 0.329683 hartree
zpe.thermalcorrenthalpy: 0.330628 hartree
zpe.thermalcorrgfe: 0.262475 hartree
zpe.sumelectzpe: -992.959958 hartree
zpe.sumelectthermal: -992.941221 hartree
zpe.sumelectthermalent: -992.940277 hartree
zpe.sumelectthermalfe: -993.008429 hartree
dipole: -0.8255 -0.4199 2.9068
dipole: 3.0508
quadrupole: -101.6295 -129.3464 -144.1515
quadrupole: 12.8074 -20.1343 -0.0354
quadrupole: 23.4129 -4.3039 -19.1090 12.8074 -20.1343 -0.0354
hfenergy: -993.2709041 hartree
pointgroup: C01 [X(C21H16N2O1)]
dipole: 0.3089738 0.0027536 -1.1598234 debye
polarizability: 489.323445|-2.4877979|258.2280237|-17.7540697|32.3167922|141.9298979 unknown
InChI: InChI=1S/C21H16N2O/c1-14(24)22-15-10-12-16(13-11-15)23-21-19-8-4-2-6-17(19)18-7-3-5-9-20(18)21/h2-13,22H,1H3
charge 0 multiplicity 1
40 atoms
O  5.664677 0.371035 1.489334
N  -0.544105 -1.193916 -0.472719
N  5.12296 -0.729423 -0.51408
C  -3.702652 0.441868 0.19134
C  -2.811931 1.62406 0.191731
C  -2.906035 -0.712467 -0.067638
C  -1.464203 1.190637 -0.041221
C  -1.475849 -0.307476 -0.208491
C  -5.091063 0.317619 0.385717
C  -3.111416 2.9897 0.348811
C  -3.477613 -1.994076 -0.137669
C  -0.424556 2.137664 -0.143927
C  -5.672397 -0.97438 0.314303
C  -2.059082 3.934912 0.259334
C  -4.876332 -2.118882 0.054333
C  -0.731125 3.513388 0.006458
C  0.850839 -0.978758 -0.467003
C  1.544183 -0.395929 0.633872
C  1.6201 -1.507372 -1.542375
C  3.701823 -0.79261 -0.449572
C  2.948224 -0.308138 0.654907
C  3.019328 -1.392423 -1.54447
C  6.0208 -0.182275 0.40815
C  7.486427 -0.314935 -0.009783
H  -5.717832 1.193074 0.588442
H  -4.139072 3.32397 0.52864
H  -2.8451 -2.865002 -0.335448
H  0.60544 1.827029 -0.335957
H  -6.751916 -1.091191 0.462531
H  -2.274539 5.00237 0.38065
H  -5.349085 -3.105769 0.002986
H  0.069508 4.256955 -0.069318
H  0.971773 -0.036202 1.495877
H  1.097742 -1.994465 -2.371296
H  3.471735 0.128767 1.507002
H  3.590206 -1.785609 -2.396051
H  5.538364 -1.144258 -1.352103
H  7.782614 -1.3760 -0.107967
H  8.112765 0.155005 0.761773
H  7.678796 0.186608 -0.976602
