program: Gaussian 09
title: 000224075
version: EM64L-G09RevD.01
frameworkgroup: C1[X(C21H15FN2O)]
method: RPBEPBE
basis: SDD
operation: Freq
keyword: #p
keyword: freq=noraman
keyword: PBEPBE/SDD
title: #p freq=noraman PBEPBE/SDD
converged: YES YES NO NO
title: Mulliken charges:
elementType: F O N N C C C C C C C C C C C C C C C C C C C C C H H H H H H H H H H H H H H H
charge: -0.212715 -0.246176 0.014841 -0.450920 0.249600 0.312652 0.249276 0.279064 -0.509102 -0.574159 -0.396810 -0.419724 0.534128 -0.383229 -0.486366 -0.223973 -0.266816 0.312883 -0.343669 -0.343763 0.208789 -0.350699 -0.351166 0.301863 -0.800594 0.357171 0.247775 0.247717 0.282310 0.221776 0.231021 0.235079 0.310718 0.254605 0.254706 0.253982 0.254060 0.237058 0.271750 0.237059
chargesum: 0.00000
title: Mulliken charges with hydrogens summed into heavy atoms:
elementType: F O N N C C C C C C C C C C C C C C C C C C C C C
charge: -0.212715 -0.246176 0.014841 -0.140202 0.249600 0.312652 0.249276 0.279064 -0.509102 -0.216988 -0.149035 -0.172007 0.534128 -0.100919 -0.264590 0.007048 -0.031737 0.312883 -0.089064 -0.089057 0.208789 -0.096717 -0.097106 0.301863 -0.054726
polarizability: 3.92873814e+02 -1.14519584e+01 2.92522132e+02 2.35158244e-02 3.03483348e-01 1.36528301e+02
1716.lowfreq: -76.3258 -34.2625 -5.4761 -2.6298 -0.0002 0.0004 0.0006 4.3567 33.2005
frequency: -76.3223 -34.2158 33.1992 36.5552 39.5997 58.0482 84.4181 102.6246 125.6729 141.3285 148.1948 168.8501 216.6237 229.4500 281.0665 324.5893 343.6816 350.1806 354.0599 398.7238 404.8008 428.0583 438.1241 446.8444 464.0616 507.5143 512.4475 524.5855 546.5651 557.4688 571.3499 603.8278 630.4645 640.6192 640.6718 655.2225 681.4401 691.1019 714.4634 734.8305 757.9466 760.7685 797.9078 804.5368 813.7563 826.3989 827.6450 842.5089 856.3497 899.5158 927.7974 928.7484 942.6903 950.6669 961.6260 962.1924 974.1875 987.9415 994.6645 998.3100 1005.3093 1030.1455 1036.1932 1075.7771 1097.3194 1116.8847 1143.5759 1150.4706 1170.2407 1187.5820 1189.2007 1209.0908 1224.8012 1237.3379 1275.6283 1280.7135 1282.7247 1308.2460 1348.4530 1367.2765 1374.2159 1387.8210 1407.0902 1440.6743 1446.1966 1452.9232 1464.7753 1467.6695 1478.0426 1490.2997 1513.5443 1585.4977 1593.1583 1601.5218 1605.7975 1610.7605 1626.9835 1637.5701 1657.4226 2987.4629 3072.6596 3113.2595 3128.3816 3137.3668 3142.7031 3148.0672 3153.6712 3154.2093 3158.3284 3174.5979 3174.8959 3178.4657 3195.3348 3521.7421
redmass: 1.0436 4.0461 8.5635 6.5127 5.2990 4.5910 6.3636 4.2810 4.9681 6.9276 4.1792 6.9370 6.2238 4.9050 4.1352 7.8816 6.9287 4.8469 6.2778 3.3936 3.3209 4.8872 3.6787 6.0739 3.6299 4.1478 4.3694 4.9606 4.6130 5.4629 3.0880 3.2350 6.0449 5.9879 1.2457 6.0061 3.7186 5.7313 4.2195 5.8937 1.3927 5.5809 2.4783 1.2928 4.2547 2.0273 2.7524 1.8871 5.7307 1.6145 2.6542 1.9315 1.3386 1.4383 2.5123 1.4230 1.4824 3.0119 1.3485 2.7623 2.7992 1.6646 1.9880 3.2490 1.2916 1.9515 1.6469 1.3918 1.3228 1.9144 1.8529 2.4279 2.4093 3.1161 2.0478 1.6764 1.2644 2.0886 6.0847 5.5938 1.2700 3.9540 4.0242 1.8561 1.9764 1.6391 3.9819 1.0470 2.8308 3.9028 1.9734 7.9770 6.7599 6.8623 6.5351 7.1707 7.3426 5.1715 11.9827 1.0383 1.0984 1.0887 1.0862 1.0979 1.0911 1.0953 1.0888 1.0884 1.0954 1.0981 1.0968 1.0976 1.0937 1.0763
irintensity: 0.0057 0.0845 0.1527 2.8519 1.5365 8.1970 2.1741 0.0798 0.4337 0.0874 0.3241 6.3103 0.6964 0.0171 1.0873 2.9926 3.2697 0.6847 1.0231 0.3288 0.1753 2.5160 0.0845 8.0688 10.1912 11.2158 6.1725 8.1182 4.1966 24.2961 3.4331 10.7894 4.7284 8.7305 50.7362 2.9001 1.1428 9.0982 12.4052 9.8583 83.4711 9.7015 14.0382 2.2181 24.8801 52.7212 17.8212 29.8013 23.9189 0.0894 1.0309 4.2454 0.0362 0.6445 38.1403 0.1117 24.4330 16.7946 0.0379 15.1113 1.6652 7.6059 3.5539 5.7609 16.0240 19.4652 30.4975 41.3056 17.9887 37.4532 68.3510 1.6334 23.9529 112.5518 13.3615 25.6725 0.7520 29.5676 1.0179 85.0921 82.1492 79.9078 0.2171 36.9531 106.1532 13.7516 218.0302 19.8782 149.8280 275.2351 170.1140 0.8151 4.6909 40.1979 5.9123 75.7684 19.6104 74.0826 249.3884 9.9118 15.0764 25.2646 3.4004 6.3607 5.0738 19.8726 1.9133 8.5990 26.8074 16.5956 5.3996 3.2683 10.0643 13.4859
temp: 298.150 k
press: 1.00000 atm
elementType: 9 8 7 7 6 6 6 6 6 6 6 6 6 6 6 6 6 6 6 6 6 6 6 6 6 1 1 1 1 1 1 1 1 1 1 1 1 1 1 1
symmnumber: 1
zpe: 793528.3 jmol-1
zpe.correction: 0.302239 hartree
zpe.thermalcorrener: 0.321231 hartree
zpe.thermalcorrenthalpy: 0.322175 hartree
zpe.thermalcorrgfe: 0.253617 hartree
zpe.sumelectzpe: -1092.128332 hartree
zpe.sumelectthermal: -1092.109341 hartree
zpe.sumelectthermalent: -1092.108396 hartree
zpe.sumelectthermalfe: -1092.176954 hartree
dipole: 5.6644 5.0736 -0.0001
dipole: 7.6043
quadrupole: -114.9437 -143.5073 -140.9230
quadrupole: -4.8292 0.0341 0.0934
quadrupole: 18.1810 -10.3826 -7.7983 -4.8292 0.0341 0.0934
hfenergy: -1092.4305711 hartree
pointgroup: C01 [X(C21H15F1N2O1)]
dipole: 2.1161409 -2.1148738 -0.0015414 debye
polarizability: 393.8237334|5.9087057|291.5712793|0.1006124|0.4831304|136.5292339 unknown
InChI: InChI=1S/C21H15FN2O/c1-13(25)23-16-10-11-18-17-4-2-3-5-19(17)21(20(18)12-16)24-15-8-6-14(22)7-9-15/h2-12,23H,1H3
charge 0 multiplicity 1
40 atoms
F  -6.026505 2.86167 -0.00303
O  3.952795 2.793407 0.00503
N  -0.681771 1.070294 0.003097
N  4.798489 0.601478 0.001003
C  1.367028 -1.909216 -0.001215
C  1.213912 -0.492344 0.000624
C  0.023524 -2.527017 -0.00135
C  -0.962125 -1.486376 0.000039
C  -0.247028 -0.162029 0.001286
C  2.304644 0.387297 0.001418
C  2.659005 -2.46638 -0.00237
C  -0.36568 -3.878692 -0.002232
C  3.611346 -0.1826 0.000307
C  -2.335421 -1.79794 0.000904
C  3.773008 -1.598945 -0.001604
C  -1.749571 -4.189279 -0.001541
C  -2.723917 -3.162286 0.000124
C  -2.052214 1.44733 0.001898
C  -2.721977 1.710845 1.228971
C  -2.727231 1.687663 -1.227122
C  4.933154 1.996524 0.003101
C  -4.052823 2.180133 1.231351
C  -4.05787 2.157533 -1.23275
C  -4.694417 2.389976 -0.001427
C  6.387934 2.46909 0.003689
H  2.166793 1.469569 0.002837
H  2.813959 -3.550353 -0.003807
H  0.378983 -4.682107 -0.003299
H  -3.094399 -1.011415 0.002109
H  4.785459 -2.023583 -0.002469
H  -2.070157 -5.23711 -0.002204
H  -3.787578 -3.422803 0.000778
H  5.672391 0.06948 -0.000068
H  -2.19255 1.551743 2.173229
H  -2.201954 1.510569 -2.170519
H  -4.581639 2.383548 2.167071
H  -4.590457 2.34383 -2.169894
H  6.928302 2.107904 0.89846
H  6.397392 3.568168 0.005782
H  6.927868 2.111321 -0.892714
