program: Gaussian 09
title: 000224069
version: EM64L-G09RevD.01
frameworkgroup: C1[X(C22H16)]
method: RPBEPBE
basis: SDD
operation: Freq
keyword: #p
keyword: freq=noraman
keyword: PBEPBE/SDD
title: #p freq=noraman PBEPBE/SDD
converged: YES YES NO NO
title: Mulliken charges:
elementType: C C C C C C C C C C C C C C C C C C C C C C H H H H H H H H H H H H H H H H
charge: 0.146727 0.131220 0.036976 0.131474 0.351713 -0.402766 -0.416567 -0.377719 -0.347702 -0.355786 -0.242575 -0.238599 -0.253979 -0.275199 -0.177565 -0.333479 0.482811 -0.389945 -0.395420 -0.238124 -0.239959 -0.241890 0.244973 0.247285 0.236869 0.219836 0.224098 0.227053 0.227689 0.225700 0.225201 0.211510 0.217466 0.221112 0.229618 0.227370 0.228946 0.231627
chargesum: 0.00000
title: Mulliken charges with hydrogens summed into heavy atoms:
elementType: C C C C C C C C C C C C C C C C C C C C C C
charge: 0.146727 0.131220 0.036976 0.131474 0.351713 -0.157794 -0.169282 -0.140850 -0.127866 -0.131688 -0.015522 -0.010910 -0.028279 -0.049997 0.033945 -0.116013 0.482811 -0.168833 -0.165801 -0.010753 -0.011013 -0.010263
polarizability: 5.85061129e+02 2.70496520e+00 2.99727312e+02 1.06255258e-01 1.80643817e-01 8.84066833e+01
1716.lowfreq: -7.3946 -0.0006 -0.0002 0.0010 3.3555 7.0690 24.5601 32.7276 38.7897
frequency: 24.3529 32.7189 38.7744 77.5595 106.8995 134.6990 136.6307 165.0972 174.7190 213.7279 244.1501 283.3322 320.6110 327.7490 401.7571 406.5781 417.0053 431.9437 461.1910 467.5144 511.1210 515.5849 541.3640 567.3742 614.6934 614.9323 625.8814 638.9151 652.2476 692.4217 721.8932 736.8411 752.1777 767.7042 769.0526 788.0114 796.6867 841.8632 843.5356 865.7911 875.8997 883.5404 900.8445 912.9302 923.3921 943.8071 948.0907 976.4329 978.8446 981.0712 984.4683 986.6175 993.5771 998.0412 1023.0871 1025.2559 1032.2310 1075.8676 1083.3417 1111.6697 1134.3555 1168.9667 1172.3438 1174.7321 1190.5677 1195.9650 1206.5582 1228.0807 1249.6607 1264.1120 1299.9303 1304.7973 1313.0826 1330.0369 1361.0533 1382.0199 1391.0925 1402.2513 1436.7546 1438.6278 1445.8789 1466.9844 1475.2203 1484.3527 1576.3001 1582.0562 1586.5322 1594.3490 1608.8856 1610.5813 1613.5586 1633.0512 3076.5772 3081.4145 3119.6727 3120.1404 3124.0835 3126.1199 3128.2196 3136.1050 3139.0753 3141.5798 3148.7211 3151.8304 3159.1404 3160.9872 3166.1803 3174.8261
redmass: 3.9357 4.4010 5.2575 4.2882 4.5463 3.6102 5.3700 3.0683 5.2807 2.3692 5.1401 3.9299 4.9176 3.7876 2.8257 2.9930 6.5259 3.6455 3.0208 4.8146 5.4910 2.8948 6.0570 3.2420 6.8275 6.5698 5.4852 3.5732 6.1922 1.6892 5.3960 1.5539 1.4247 1.7114 5.7692 2.4632 2.4433 1.2997 4.3804 1.6236 1.3836 1.6554 6.1186 1.6504 1.5174 1.4684 1.4347 1.3324 1.2837 1.3361 1.2773 6.1040 7.2001 1.3042 2.2975 2.1900 1.9739 3.0651 1.6631 1.7384 1.8814 1.1151 1.1094 1.0961 1.1192 2.0739 2.0611 1.8227 1.7479 1.8415 1.7943 1.7311 1.5697 1.3593 2.1570 5.4568 3.1601 3.5136 2.3113 2.5581 2.6451 2.7472 3.4426 2.5278 5.5707 6.2012 6.6352 5.4425 5.9514 7.2916 6.6509 6.5195 1.0882 1.0887 1.0869 1.0855 1.0856 1.0860 1.0888 1.0904 1.0913 1.0943 1.0957 1.0938 1.0941 1.1000 1.1015 1.0930
irintensity: 0.0152 0.1372 0.1423 0.4341 1.5964 0.1037 0.0345 0.5221 0.2709 2.1474 0.1221 0.0070 3.3901 0.3371 0.8691 5.4545 0.0354 1.5627 0.6685 7.8242 0.5546 7.5053 13.1198 0.0091 1.1843 0.5470 2.7955 9.3588 0.9539 47.3551 0.5389 86.6576 31.2759 64.5498 5.1134 10.7169 40.8435 0.0047 1.2068 0.5450 0.0022 0.2014 2.1881 0.0807 0.1162 0.0699 1.3941 11.6574 38.1078 4.4171 14.8972 0.0734 3.4076 10.1985 4.0099 4.9293 6.7563 3.1204 8.7197 1.8516 4.3043 1.7866 0.0929 0.6892 3.1225 6.7758 0.4499 4.0636 19.6773 4.6771 4.2782 0.2767 1.1965 4.0284 0.7730 15.3846 4.6015 1.6346 31.9707 30.2091 61.3050 2.4148 81.8256 0.7196 0.7982 1.9797 2.4641 6.5713 1.1597 7.4058 5.4013 63.0760 3.6420 22.4792 8.9949 4.5249 2.8510 5.5026 1.1093 9.6411 6.5966 23.8865 16.8692 55.1029 14.4151 61.4717 45.6047 35.6442
temp: 298.150 k
press: 1.00000 atm
elementType: 6 6 6 6 6 6 6 6 6 6 6 6 6 6 6 6 6 6 6 6 6 6 1 1 1 1 1 1 1 1 1 1 1 1 1 1 1 1
symmnumber: 1
zpe: 794568.8 jmol-1
zpe.correction: 0.302635 hartree
zpe.thermalcorrener: 0.319677 hartree
zpe.thermalcorrenthalpy: 0.320622 hartree
zpe.thermalcorrgfe: 0.256141 hartree
zpe.sumelectzpe: -846.477059 hartree
zpe.sumelectthermal: -846.460017 hartree
zpe.sumelectthermalent: -846.459073 hartree
zpe.sumelectthermalfe: -846.523554 hartree
dipole: -1.4655 -0.1237 0.0001
dipole: 1.4707
quadrupole: -104.7749 -108.6728 -139.8503
quadrupole: 0.6516 0.0141 0.0605
quadrupole: 12.9911 9.0932 -22.0843 0.6516 0.0141 0.0605
hfenergy: -846.7796944 hartree
pointgroup: C01 [X(C22H16)]
dipole: 0.572384 0.0846017 -0.0013122 debye
polarizability: 583.5996918|20.4968022|301.1164432|-2.2060471|3.5520478|88.4789894 unknown
InChI: InChI=1S/C22H16/c1-2-9-17(10-3-1)11-8-16-22-20-14-6-4-12-18(20)19-13-5-7-15-21(19)22/h1-16H
charge 0 multiplicity 1
38 atoms
C  -3.490572 0.041713 0.021059
C  -2.881323 -1.299677 -0.00766
C  -2.432113 1.006657 0.032938
C  -1.448868 -1.152097 -0.012867
C  -1.124387 0.300218 0.012646
C  -4.839415 0.447895 0.036144
C  -3.484451 -2.571758 -0.028851
C  -2.733685 2.385115 0.060211
C  -0.640107 -2.311789 -0.039746
C  0.090324 0.967773 0.018146
C  -5.134031 1.832409 0.063292
C  -2.660384 -3.721703 -0.055735
C  -4.08904 2.792142 0.075225
C  -1.249868 -3.589368 -0.061048
C  1.427162 0.426594 0.002176
C  2.549619 1.230879 0.009474
C  3.950753 0.801021 -0.00401
C  4.351919 -0.569815 -0.020308
C  4.974423 1.795504 0.000093
C  5.714342 -0.922978 -0.032208
C  6.338674 1.441598 -0.011926
C  6.716933 0.07881 -0.028186
H  -5.651279 -0.287842 0.027129
H  -4.575279 -2.675125 -0.024922
H  -1.940111 3.14105 0.070037
H  0.45098 -2.253909 -0.044796
H  0.040435 2.067258 0.037638
H  -6.176932 2.168334 0.075311
H  -3.113086 -4.719354 -0.072692
H  -4.33562 3.859548 0.096458
H  -0.621514 -4.486708 -0.082007
H  1.551836 -0.659988 -0.016459
H  2.389642 2.320301 0.027347
H  3.595358 -1.362116 -0.022963
H  4.686662 2.854296 0.012863
H  6.001585 -1.980444 -0.044484
H  7.105624 2.223948 -0.008357
H  7.775996 -0.201189 -0.03756
