program: Gaussian 09
title: 000217869
version: EM64L-G09RevD.01
frameworkgroup: C1[X(C12H14ClNO4S)]
method: RPBEPBE
basis: SDD
operation: Freq
keyword: #p
keyword: freq=noraman
keyword: PBEPBE/SDD
title: #p freq=noraman PBEPBE/SDD
converged: YES YES NO NO
title: Mulliken charges:
elementType: Cl S O O O O N C C C C C C C C C C C C H H H H H H H H H H H H H H
charge: 0.057536 0.837550 -0.509468 -0.512096 -0.432326 -0.437604 -0.235784 0.660712 0.383852 -0.190101 -0.637689 -0.400383 -0.400469 -0.342250 -0.257139 -0.323219 -0.320716 -0.240775 -0.222913 0.254655 0.203941 0.243158 0.227626 0.252276 0.275765 0.230721 0.212160 0.229617 0.211577 0.241576 0.249796 0.341310 0.349107
chargesum: 0.00000
title: Mulliken charges with hydrogens summed into heavy atoms:
elementType: Cl S O O O O N C C C C C C C C C C C C
charge: 0.057536 0.837550 -0.509468 -0.512096 -0.091016 -0.088497 -0.235784 0.660712 0.383852 -0.190101 -0.637689 0.058213 0.070316 -0.089974 0.018626 0.119662 0.120477 0.000800 0.026883
polarizability: 2.20507007e+02 -8.99352804e+00 2.13380968e+02 3.31417785e+00 -1.35401851e+01 1.30570432e+02
1716.lowfreq: -5.2401 0.0013 0.0019 0.0020 6.9536 8.3143 30.9211 36.6883 42.0535
frequency: 30.7509 36.6122 42.0299 52.9550 77.0848 92.6228 101.6128 112.0958 119.2846 145.6913 157.2286 169.2663 181.9983 201.8731 255.2562 279.7245 296.1717 301.5488 315.4752 333.0833 353.8046 362.4452 390.5256 424.7440 437.3606 451.4370 459.6145 488.2952 505.2796 552.8688 626.8586 654.5436 667.7360 703.9937 735.9698 773.2704 809.8712 826.7788 835.1387 858.5375 880.2261 883.4046 894.6240 932.2376 956.0146 959.0030 997.8265 1004.3471 1007.0735 1022.8011 1034.8829 1044.2877 1068.5367 1121.1024 1138.3117 1153.5646 1176.3898 1177.4396 1196.8328 1252.8424 1256.8075 1274.3775 1322.8986 1331.3854 1338.3518 1343.7768 1365.6241 1375.0628 1378.5915 1393.5462 1428.2773 1440.0092 1449.1193 1457.7456 1469.2164 1471.6061 1563.0509 1582.5650 1612.0927 2967.3659 2976.2641 2985.4656 2999.3595 3062.8277 3074.3051 3079.3882 3087.8797 3142.5526 3154.5827 3164.1396 3178.2846 3534.5552 3575.0788
redmass: 6.7615 6.3799 8.2103 6.6391 4.3475 5.4090 6.5540 4.6496 5.0585 5.5365 7.9495 3.7782 5.3376 4.3704 4.0222 5.3451 1.3192 3.2562 2.0682 7.8199 2.3162 2.6480 3.8528 3.3805 10.3436 4.0781 4.1936 3.0374 3.8179 2.6046 6.6769 4.9689 6.5552 4.5263 3.6585 1.3900 12.1021 7.2964 3.3234 2.7207 1.3458 2.3727 2.1409 20.3541 1.4030 2.3560 1.3453 4.0463 3.7083 2.5063 3.0579 2.1133 2.2294 1.6295 1.7391 2.5807 1.0902 1.3635 1.4844 1.8353 1.3191 1.5076 1.2458 1.3694 1.4331 1.2324 1.5116 1.2370 1.2192 6.0579 2.4162 1.0815 2.4016 1.0836 1.1371 1.0880 6.7622 7.9223 7.9174 1.0683 1.0635 1.0670 1.0606 1.0999 1.1029 1.0948 1.0963 1.0865 1.0898 1.0948 1.1005 1.0651 1.0669
irintensity: 2.5124 0.9250 1.0977 1.8575 1.9435 3.0415 2.5526 2.1669 6.9165 1.6428 4.4804 6.4744 1.0376 7.4272 24.0803 8.9677 167.0862 37.3933 9.4367 8.4231 18.4704 20.8438 22.9713 20.6677 24.9578 46.5383 30.6892 6.9534 4.8939 0.8705 11.4512 10.8368 4.7559 1.7244 10.1755 74.6290 101.4701 8.7023 10.6398 21.8678 1.5652 43.6726 11.5020 82.1658 4.4063 66.1879 0.5453 46.0837 44.3983 2.8464 38.0936 15.3636 20.8440 9.6718 22.7351 23.2962 2.0089 28.8251 8.3026 25.5609 8.7249 4.7620 24.2063 26.3930 0.3707 4.4283 3.1596 13.6792 25.5568 0.8452 11.6028 13.8470 19.3184 6.0509 1.6706 10.7446 74.0553 46.9924 13.5166 35.8277 26.0602 37.9340 28.0506 31.0277 25.1305 12.2804 33.2769 1.8939 6.9460 4.3654 14.3264 1.1663 3.0932
temp: 298.150 k
press: 1.00000 atm
elementType: 17 16 8 8 8 8 7 6 6 6 6 6 6 6 6 6 6 6 6 1 1 1 1 1 1 1 1 1 1 1 1 1 1
symmnumber: 1
zpe: 639758.9 jmol-1
zpe.correction: 0.243671 hartree
zpe.thermalcorrener: 0.263721 hartree
zpe.thermalcorrenthalpy: 0.264665 hartree
zpe.thermalcorrgfe: 0.193702 hartree
zpe.sumelectzpe: -1677.778401 hartree
zpe.sumelectthermal: -1677.758351 hartree
zpe.sumelectthermalent: -1677.757407 hartree
zpe.sumelectthermalfe: -1677.828370 hartree
dipole: 0.8037 5.5658 -2.4157
dipole: 6.1204
quadrupole: -130.0401 -129.6446 -139.3583
quadrupole: -21.9245 4.8730 -11.3382
quadrupole: 2.9743 3.3697 -6.3440 -21.9245 4.8730 -11.3382
hfenergy: -1678.0220721 hartree
pointgroup: C01 [X(C12H14Cl1N1O4S1)]
dipole: 0.1514919 -1.9473345 1.4082664 debye
polarizability: 221.7282668|6.3781294|202.3033161|-8.0160588|-29.446551|140.4268237 unknown
InChI: InChI=1S/C12H14ClNO4S/c13-12-11(14(5-7-15)6-8-16)9-3-1-2-4-10(9)19(12,17)18/h1-4,15-16H,5-8H2
charge 0 multiplicity 1
33 atoms
Cl 1.368852 2.563836 -1.105364
S  -1.681065 1.844718 -0.660936
O  -2.304176 1.945687 -2.163881
O  -1.905037 3.088975 0.367289
O  1.799511 -2.660454 -2.121038
O  3.829855 0.88321 1.510213
N  1.593194 -0.617866 0.01424
C  0.368056 0.074193 -0.116753
C  -0.914311 -0.595856 0.277642
C  -2.093197 0.162347 0.108135
C  0.179726 1.333111 -0.629407
C  2.612422 -0.556539 -1.074729
C  2.067458 -0.896466 1.399316
C  -1.058858 -1.929419 0.72641
C  -3.382121 -0.305337 0.360845
C  2.086012 -1.241742 -2.34945
C  2.617696 0.343997 2.138947
C  -2.34803 -2.432494 1.019851
C  -3.502532 -1.632995 0.847952
H  3.495132 -1.104737 -0.705892
H  2.938382 0.473836 -1.320245
H  2.857482 -1.665896 1.339562
H  1.233645 -1.3071 2.000687
H  -0.179209 -2.572973 0.83096
H  -4.263551 0.318998 0.186671
H  2.867464 -1.219687 -3.126767
H  1.191019 -0.712012 -2.738948
H  2.926217 0.040435 3.155066
H  1.828098 1.118408 2.22954
H  -2.453065 -3.462889 1.374644
H  -4.492506 -2.040501 1.075159
H  1.182282 -2.714777 -1.345725
H  3.57765 1.51559 0.791905
